211	178	184	129	204	182	196	128	228	134	225	206
198	166	184	255	177	182	198	176	234	168	185	140
184	173	225	144	220	168	171	179	255	183	227	170
228	223	236	179	227	193	208	180	206	175	230	165
211	178	184	129	204	182	196	128	228	134	225	206
198	166	184	255	177	182	198	176	234	168	185	140
184	173	225	144	220	168	171	179	255	183	227	170
228	223	236	179	227	193	208	180	206	175	230	165
