(module PIN_ARRAY_2X1_3960um (layer F.Cu) (tedit 5D5DC2AC)
  (descr "Connecteurs 2 pins")
  (tags "CONN DEV")
  (fp_text reference P1 (at -0.1 -4.8) (layer F.SilkS)
    (effects (font (size 0.762 0.762) (thickness 0.1524)))
  )
  (fp_text value CONN_2 (at 0 -3.5) (layer F.SilkS) hide
    (effects (font (size 0.762 0.762) (thickness 0.1524)))
  )
  (fp_line (start 3.6 4.6) (end -3.6 4.6) (layer F.SilkS) (width 0.1524))
  (fp_line (start 3.54 -5.6) (end 3.54 4.6) (layer F.SilkS) (width 0.1524))
  (fp_line (start -3.6 -5.6) (end 3.6 -5.6) (layer F.SilkS) (width 0.1524))
  (fp_line (start -3.64 4.6) (end -3.64 -5.6) (layer F.SilkS) (width 0.1524))
  (pad 2 thru_hole circle (at 1.98 0) (size 2.5 2.5) (drill 1.8) (layers *.Cu *.Mask F.SilkS))
  (pad 1 thru_hole rect (at -1.98 0) (size 2.3 2.3) (drill 1.8) (layers *.Cu *.Mask F.SilkS)
    (zone_connect 1) (thermal_width 0.5) (thermal_gap 0.4))
  (model ${KISYS3DMOD}/Connector_Phoenix_MC.3dshapes/PhoenixContact_MCV_1,5_2-G-3.5_1x02_P3.50mm_Vertical.step
    (offset (xyz -1.75 0 0))
    (scale (xyz 1 1 1))
    (rotate (xyz 0 0 0))
  )
)
