(module Connect:1pin locked (layer F.Cu) (tedit 5861332C)
  (descr "module 1 pin (ou trou mecanique de percage)")
  (tags DEV)
  (fp_text reference 1PIN5 (at 4.2 2.6) (layer F.SilkS)
    (effects (font (size 1 1) (thickness 0.15)))
  )
  (fp_text value P*** (at 0 3) (layer F.Fab)
    (effects (font (size 1 1) (thickness 0.15)))
  )
  (fp_circle (center 0 0) (end 0 -2.286) (layer F.SilkS) (width 0.12))
  (fp_circle (center 0 0) (end 2.6 0) (layer F.CrtYd) (width 0.05))
  (fp_circle (center 0 0) (end 2 0.8) (layer F.Fab) (width 0.1))
  (pad 1 thru_hole circle (at 0 0) (size 4.064 4.064) (drill 3.048) (layers *.Cu *.Mask))
)
