EESchema Schematic File Version 4
LIBS:lpa96-cache
EELAYER 30 0
EELAYER END
$Descr A4 11693 8268
encoding utf-8
Sheet 2 2
Title "96-well Light Plate Apparatus (LPA), Blue 465nm"
Date "2019-08-22"
Rev "2.0"
Comp "Authors: Tabor lab/Evan Olson/Sebastian Castillo/Open Bioeconomy Lab/Kevin Bibby"
Comment1 ""
Comment2 ""
Comment3 ""
Comment4 ""
$EndDescr
Wire Wire Line
	4450 1700 4350 1700
Wire Wire Line
	4450 1800 4350 1800
Wire Wire Line
	4450 1900 4350 1900
Wire Wire Line
	4450 2000 4350 2000
Wire Wire Line
	4450 2100 4350 2100
Wire Wire Line
	4450 2200 4350 2200
Wire Wire Line
	4450 2300 4350 2300
Wire Wire Line
	4350 1600 4450 1600
Wire Wire Line
	3750 2300 4050 2300
Wire Wire Line
	4050 2200 3750 2200
Wire Wire Line
	3750 2100 4050 2100
Wire Wire Line
	4050 2000 3750 2000
Wire Wire Line
	3750 1900 4050 1900
Wire Wire Line
	4050 1800 3750 1800
Wire Wire Line
	3750 1700 4050 1700
Wire Wire Line
	3750 1600 4050 1600
Wire Wire Line
	1300 2300 1400 2300
Wire Wire Line
	1300 2200 1400 2200
Wire Wire Line
	1300 2100 1400 2100
Wire Wire Line
	1300 2000 1400 2000
Wire Wire Line
	1300 1900 1400 1900
Wire Wire Line
	1300 1800 1400 1800
Wire Wire Line
	1300 1700 1400 1700
Wire Wire Line
	1400 1600 1300 1600
Connection ~ 4450 2200
Connection ~ 4450 2100
Connection ~ 4450 2000
Connection ~ 4450 1900
Connection ~ 4450 1800
Connection ~ 4450 1700
Connection ~ 4450 1600
Wire Wire Line
	4450 1500 4450 1600
Wire Wire Line
	5200 4950 1650 4950
Wire Wire Line
	5200 3650 5200 4950
Wire Wire Line
	3750 3650 5200 3650
Connection ~ 3850 5600
Wire Wire Line
	3850 5800 3750 5800
Wire Wire Line
	4450 5700 4450 5200
Wire Wire Line
	3750 5900 3950 5900
Connection ~ 4450 5200
Wire Wire Line
	3750 5600 3850 5600
Wire Wire Line
	4600 5200 4600 5350
Wire Wire Line
	4050 5200 4450 5200
Connection ~ 1300 2200
Connection ~ 1300 2100
Connection ~ 1300 2000
Connection ~ 1300 1900
Connection ~ 1300 1800
Connection ~ 1300 1700
Connection ~ 1300 1600
Wire Wire Line
	1300 1500 1300 1600
Wire Wire Line
	5200 2650 5200 1400
Wire Wire Line
	5200 1400 3750 1400
Connection ~ 3850 3250
Wire Wire Line
	3850 3450 3750 3450
Wire Wire Line
	3850 1200 3750 1200
Connection ~ 3850 1000
Wire Wire Line
	4450 3350 4450 2850
Wire Wire Line
	3750 3550 3950 3550
Connection ~ 4450 2850
Wire Wire Line
	3750 3250 3850 3250
Wire Wire Line
	4600 2850 4600 3000
Wire Wire Line
	4050 2850 4450 2850
Wire Wire Line
	4450 1100 4450 600 
Wire Wire Line
	3750 1300 3950 1300
Connection ~ 4450 600 
Wire Wire Line
	3750 1000 3850 1000
Wire Wire Line
	4600 600  4600 750 
Wire Wire Line
	4050 600  4450 600 
$Comp
L lpa96_symbols:TLC5941 U5
U 1 1 53AA07FE
P 3000 6250
F 0 "U5" H 3000 6150 50  0000 C CNN
F 1 "TLC5941" H 3000 6350 50  0000 C CNN
F 2 "lpa96_footprints:TLC5941_PWP_28" H 3000 6250 50  0001 C CNN
F 3 "DOCUMENTATION" H 3000 6250 50  0001 C CNN
	1    3000 6250
	1    0    0    -1  
$EndComp
NoConn ~ 3750 6100
$Comp
L Device:R R5
U 1 1 5363017A
P 4200 5700
F 0 "R5" V 4280 5700 40  0000 C CNN
F 1 "2.2K" V 4100 5700 40  0000 C CNN
F 2 "Resistors_SMD:R_0805" V 4130 5700 30  0001 C CNN
F 3 "~" H 4200 5700 30  0000 C CNN
	1    4200 5700
	0    1    1    0   
$EndComp
$Comp
L lpa96_symbols:TLC5941 U4
U 1 1 536301A0
P 3000 3900
F 0 "U4" H 3000 3800 50  0000 C CNN
F 1 "TLC5941" H 3000 4000 50  0000 C CNN
F 2 "lpa96_footprints:TLC5941_PWP_28" H 3000 3900 50  0001 C CNN
F 3 "DOCUMENTATION" H 3000 3900 50  0001 C CNN
	1    3000 3900
	1    0    0    -1  
$EndComp
NoConn ~ 3750 3750
$Comp
L Device:R R4
U 1 1 5363096D
P 4200 3350
F 0 "R4" V 4280 3350 40  0000 C CNN
F 1 "2.2K" V 4100 3350 40  0000 C CNN
F 2 "Resistors_SMD:R_0805" V 4130 3350 30  0001 C CNN
F 3 "~" H 4200 3350 30  0000 C CNN
	1    4200 3350
	0    1    1    0   
$EndComp
NoConn ~ 3750 1500
$Comp
L power:GND #PWR012
U 1 1 53630970
P 2050 1000
F 0 "#PWR012" H 2050 1000 30  0001 C CNN
F 1 "GND" H 2050 930 30  0001 C CNN
F 2 "" H 2050 1000 60  0000 C CNN
F 3 "" H 2050 1000 60  0000 C CNN
	1    2050 1000
	0    1    1    0   
$EndComp
$Comp
L Device:R R3
U 1 1 53630971
P 4200 1100
F 0 "R3" V 4100 1100 40  0000 C CNN
F 1 "2.2K" V 4300 1100 40  0000 C CNN
F 2 "Resistors_SMD:R_0805" V 4130 1100 30  0001 C CNN
F 3 "~" H 4200 1100 30  0000 C CNN
	1    4200 1100
	0    1    1    0   
$EndComp
$Comp
L lpa96_symbols:TLC5941 U3
U 1 1 53630973
P 3000 1650
F 0 "U3" H 3000 1550 50  0000 C CNN
F 1 "TLC5941" H 3000 1750 50  0000 C CNN
F 2 "lpa96_footprints:TLC5941_PWP_28" H 3000 1650 50  0001 C CNN
F 3 "DOCUMENTATION" H 3000 1650 50  0001 C CNN
	1    3000 1650
	1    0    0    -1  
$EndComp
Text HLabel 3950 1300 2    60   Input ~ 0
GSCLK
Text HLabel 3950 3550 2    60   Input ~ 0
GSCLK
Text HLabel 3950 5900 2    60   Input ~ 0
GSCLK
Text HLabel 4500 1500 2    60   Input ~ 0
VIN
Text HLabel 1250 1500 0    60   Input ~ 0
VIN
Wire Wire Line
	2050 1000 2250 1000
Wire Wire Line
	3750 6000 5800 6000
Connection ~ 9400 4950
Wire Wire Line
	9400 5150 9300 5150
Wire Wire Line
	10000 5050 10000 4550
Wire Wire Line
	9300 5250 9700 5250
Connection ~ 10000 4550
Wire Wire Line
	9300 4950 9400 4950
Wire Wire Line
	10150 4550 10150 4700
Wire Wire Line
	9600 4550 10000 4550
Wire Wire Line
	10750 1350 9300 1350
Wire Wire Line
	9400 1150 9300 1150
Connection ~ 9400 950 
Wire Wire Line
	10000 1050 10000 550 
Wire Wire Line
	9300 1250 9500 1250
Connection ~ 10000 550 
Wire Wire Line
	9300 950  9400 950 
Wire Wire Line
	10150 550  10150 700 
Wire Wire Line
	9600 550  10000 550 
$Comp
L lpa96_symbols:TLC5941 U8
U 1 1 53630E91
P 8550 5600
F 0 "U8" H 8550 5500 50  0000 C CNN
F 1 "TLC5941" H 8550 5700 50  0000 C CNN
F 2 "lpa96_footprints:TLC5941_PWP_28" H 8550 5600 50  0001 C CNN
F 3 "DOCUMENTATION" H 8550 5600 50  0001 C CNN
	1    8550 5600
	1    0    0    -1  
$EndComp
NoConn ~ 9300 5450
$Comp
L Device:R R8
U 1 1 53630EA4
P 9750 5050
F 0 "R8" V 9830 5050 40  0000 C CNN
F 1 "2.2K" V 9650 5050 40  0000 C CNN
F 2 "Resistors_SMD:R_0805" V 9680 5050 30  0001 C CNN
F 3 "~" H 9750 5050 30  0000 C CNN
	1    9750 5050
	0    1    1    0   
$EndComp
NoConn ~ 9300 1450
$Comp
L Device:R R6
U 1 1 53AA0819
P 9750 1050
F 0 "R6" V 9830 1050 40  0000 C CNN
F 1 "2.2K" V 9650 1050 40  0000 C CNN
F 2 "Resistors_SMD:R_0805" V 9680 1050 30  0001 C CNN
F 3 "~" H 9750 1050 30  0000 C CNN
	1    9750 1050
	0    1    1    0   
$EndComp
$Comp
L lpa96_symbols:TLC5941 U6
U 1 1 53630EE8
P 8550 1600
F 0 "U6" H 8550 1500 50  0000 C CNN
F 1 "TLC5941" H 8550 1700 50  0000 C CNN
F 2 "lpa96_footprints:TLC5941_PWP_28" H 8550 1600 50  0001 C CNN
F 3 "DOCUMENTATION" H 8550 1600 50  0001 C CNN
	1    8550 1600
	1    0    0    -1  
$EndComp
Text HLabel 9500 1250 2    60   Input ~ 0
GSCLK
Text HLabel 9700 5250 2    60   Input ~ 0
GSCLK
Text HLabel 9700 5350 2    60   Input ~ 0
SOUT
Wire Wire Line
	4450 2200 4450 2300
Wire Wire Line
	4450 2100 4450 2200
Wire Wire Line
	4450 2000 4450 2100
Wire Wire Line
	4450 1900 4450 2000
Wire Wire Line
	4450 1800 4450 1900
Wire Wire Line
	4450 1700 4450 1800
Wire Wire Line
	4450 1600 4450 1700
Wire Wire Line
	3850 5600 3850 5800
Wire Wire Line
	3850 5600 4050 5600
Wire Wire Line
	4450 5200 4600 5200
Wire Wire Line
	1300 2200 1300 2300
Wire Wire Line
	1300 2100 1300 2200
Wire Wire Line
	1300 2000 1300 2100
Wire Wire Line
	1300 1900 1300 2000
Wire Wire Line
	1300 1800 1300 1900
Wire Wire Line
	1300 1700 1300 1800
Wire Wire Line
	1300 1600 1300 1700
Wire Wire Line
	3850 3250 3850 3450
Wire Wire Line
	3850 3250 4050 3250
Wire Wire Line
	3850 1000 3850 1200
Wire Wire Line
	3850 1000 4050 1000
Wire Wire Line
	4450 2850 4600 2850
Wire Wire Line
	4450 600  4600 600 
Wire Wire Line
	9400 4950 9400 5150
Wire Wire Line
	9400 4950 9600 4950
Wire Wire Line
	10000 4550 10150 4550
Wire Wire Line
	9400 950  9400 1150
Wire Wire Line
	9400 950  9600 950 
Wire Wire Line
	10000 550  10150 550 
Wire Wire Line
	1700 1700 2250 1700
$Comp
L Device:LED_ALT LED2
U 1 1 5D6F9255
P 1550 1700
F 0 "LED2" H 1950 1700 50  0000 C CNN
F 1 "LED_ALT" H 1543 1536 50  0001 C CNN
F 2 "lpa96_footprints:VLDx1232G" H 1550 1700 50  0001 C CNN
F 3 "~" H 1550 1700 50  0001 C CNN
	1    1550 1700
	-1   0    0    1   
$EndComp
$Comp
L Device:LED_ALT LED3
U 1 1 5D726A7E
P 1550 1800
F 0 "LED3" H 1950 1800 50  0000 C CNN
F 1 "LED_ALT" H 1543 1636 50  0001 C CNN
F 2 "lpa96_footprints:VLDx1232G" H 1550 1800 50  0001 C CNN
F 3 "~" H 1550 1800 50  0001 C CNN
	1    1550 1800
	-1   0    0    1   
$EndComp
Wire Wire Line
	1700 1800 2250 1800
$Comp
L Device:LED_ALT LED4
U 1 1 5D766532
P 1550 1900
F 0 "LED4" H 1950 1900 50  0000 C CNN
F 1 "LED_ALT" H 1543 1736 50  0001 C CNN
F 2 "lpa96_footprints:VLDx1232G" H 1550 1900 50  0001 C CNN
F 3 "~" H 1550 1900 50  0001 C CNN
	1    1550 1900
	-1   0    0    1   
$EndComp
$Comp
L Device:LED_ALT LED5
U 1 1 5D76688C
P 1550 2000
F 0 "LED5" H 1950 2000 50  0000 C CNN
F 1 "LED_ALT" H 1543 1836 50  0001 C CNN
F 2 "lpa96_footprints:VLDx1232G" H 1550 2000 50  0001 C CNN
F 3 "~" H 1550 2000 50  0001 C CNN
	1    1550 2000
	-1   0    0    1   
$EndComp
$Comp
L Device:LED_ALT LED6
U 1 1 5D766AF3
P 1550 2100
F 0 "LED6" H 1950 2100 50  0000 C CNN
F 1 "LED_ALT" H 1543 1936 50  0001 C CNN
F 2 "lpa96_footprints:VLDx1232G" H 1550 2100 50  0001 C CNN
F 3 "~" H 1550 2100 50  0001 C CNN
	1    1550 2100
	-1   0    0    1   
$EndComp
$Comp
L Device:LED_ALT LED7
U 1 1 5D766FD8
P 1550 2200
F 0 "LED7" H 1950 2200 50  0000 C CNN
F 1 "LED_ALT" H 1543 2036 50  0001 C CNN
F 2 "lpa96_footprints:VLDx1232G" H 1550 2200 50  0001 C CNN
F 3 "~" H 1550 2200 50  0001 C CNN
	1    1550 2200
	-1   0    0    1   
$EndComp
$Comp
L Device:LED_ALT LED8
U 1 1 5D767248
P 1550 2300
F 0 "LED8" H 1950 2300 50  0000 C CNN
F 1 "LED_ALT" H 1543 2136 50  0001 C CNN
F 2 "lpa96_footprints:VLDx1232G" H 1550 2300 50  0001 C CNN
F 3 "~" H 1550 2300 50  0001 C CNN
	1    1550 2300
	-1   0    0    1   
$EndComp
Wire Wire Line
	1700 1900 2250 1900
Wire Wire Line
	1700 2000 2250 2000
Wire Wire Line
	1700 2100 2250 2100
Wire Wire Line
	1700 2200 2250 2200
Wire Wire Line
	1700 2300 2250 2300
$Comp
L Device:LED_ALT LED16
U 1 1 5D87013C
P 4200 1600
F 0 "LED16" H 4600 1600 50  0000 C CNN
F 1 "LED_ALT" H 4193 1436 50  0001 C CNN
F 2 "lpa96_footprints:VLDx1232G" H 4200 1600 50  0001 C CNN
F 3 "~" H 4200 1600 50  0001 C CNN
	1    4200 1600
	1    0    0    1   
$EndComp
$Comp
L Device:LED_ALT LED15
U 1 1 5D870146
P 4200 1700
F 0 "LED15" H 4600 1700 50  0000 C CNN
F 1 "LED_ALT" H 4193 1536 50  0001 C CNN
F 2 "lpa96_footprints:VLDx1232G" H 4200 1700 50  0001 C CNN
F 3 "~" H 4200 1700 50  0001 C CNN
	1    4200 1700
	1    0    0    1   
$EndComp
$Comp
L Device:LED_ALT LED14
U 1 1 5D870150
P 4200 1800
F 0 "LED14" H 4600 1800 50  0000 C CNN
F 1 "LED_ALT" H 4193 1636 50  0001 C CNN
F 2 "lpa96_footprints:VLDx1232G" H 4200 1800 50  0001 C CNN
F 3 "~" H 4200 1800 50  0001 C CNN
	1    4200 1800
	1    0    0    1   
$EndComp
$Comp
L Device:LED_ALT LED13
U 1 1 5D87015A
P 4200 1900
F 0 "LED13" H 4600 1900 50  0000 C CNN
F 1 "LED_ALT" H 4193 1736 50  0001 C CNN
F 2 "lpa96_footprints:VLDx1232G" H 4200 1900 50  0001 C CNN
F 3 "~" H 4200 1900 50  0001 C CNN
	1    4200 1900
	1    0    0    1   
$EndComp
$Comp
L Device:LED_ALT LED12
U 1 1 5D870164
P 4200 2000
F 0 "LED12" H 4600 2000 50  0000 C CNN
F 1 "LED_ALT" H 4193 1836 50  0001 C CNN
F 2 "lpa96_footprints:VLDx1232G" H 4200 2000 50  0001 C CNN
F 3 "~" H 4200 2000 50  0001 C CNN
	1    4200 2000
	1    0    0    1   
$EndComp
$Comp
L Device:LED_ALT LED11
U 1 1 5D87016E
P 4200 2100
F 0 "LED11" H 4600 2100 50  0000 C CNN
F 1 "LED_ALT" H 4193 1936 50  0001 C CNN
F 2 "lpa96_footprints:VLDx1232G" H 4200 2100 50  0001 C CNN
F 3 "~" H 4200 2100 50  0001 C CNN
	1    4200 2100
	1    0    0    1   
$EndComp
$Comp
L Device:LED_ALT LED10
U 1 1 5D870178
P 4200 2200
F 0 "LED10" H 4600 2200 50  0000 C CNN
F 1 "LED_ALT" H 4193 2036 50  0001 C CNN
F 2 "lpa96_footprints:VLDx1232G" H 4200 2200 50  0001 C CNN
F 3 "~" H 4200 2200 50  0001 C CNN
	1    4200 2200
	1    0    0    1   
$EndComp
$Comp
L Device:LED_ALT LED9
U 1 1 5D870182
P 4200 2300
F 0 "LED9" H 4600 2300 50  0000 C CNN
F 1 "LED_ALT" H 4193 2136 50  0001 C CNN
F 2 "lpa96_footprints:VLDx1232G" H 4200 2300 50  0001 C CNN
F 3 "~" H 4200 2300 50  0001 C CNN
	1    4200 2300
	1    0    0    1   
$EndComp
Wire Wire Line
	4450 1500 4500 1500
Wire Wire Line
	1300 1500 1250 1500
Wire Wire Line
	1700 1600 2250 1600
$Comp
L Device:LED_ALT LED1
U 1 1 5D6ED0C9
P 1550 1600
F 0 "LED1" H 1950 1600 50  0000 C CNN
F 1 "LED_ALT" H 1543 1436 50  0001 C CNN
F 2 "lpa96_footprints:VLDx1232G" H 1550 1600 50  0001 C CNN
F 3 "~" H 1550 1600 50  0001 C CNN
	1    1550 1600
	-1   0    0    1   
$EndComp
Text HLabel 2100 1100 0    60   Input ~ 0
BLANK
Text HLabel 2100 1500 0    60   Input ~ 0
MODE
Text HLabel 2100 1400 0    60   Input ~ 0
SIN
Text HLabel 2100 1300 0    60   Input ~ 0
SCLK
Text HLabel 2100 1200 0    60   Input ~ 0
XLAT
Wire Wire Line
	2250 1200 2100 1200
Wire Wire Line
	2250 1300 2100 1300
Wire Wire Line
	2250 1400 2100 1400
Wire Wire Line
	2250 1500 2100 1500
Wire Wire Line
	2100 1100 2250 1100
Wire Wire Line
	1300 4550 1400 4550
Wire Wire Line
	1300 4450 1400 4450
Wire Wire Line
	1300 4350 1400 4350
Wire Wire Line
	1300 4250 1400 4250
Wire Wire Line
	1300 4150 1400 4150
Wire Wire Line
	1300 4050 1400 4050
Wire Wire Line
	1300 3950 1400 3950
Wire Wire Line
	1400 3850 1300 3850
Connection ~ 1300 4450
Connection ~ 1300 4350
Connection ~ 1300 4250
Connection ~ 1300 4150
Connection ~ 1300 4050
Connection ~ 1300 3950
Connection ~ 1300 3850
Wire Wire Line
	1300 3750 1300 3850
$Comp
L power:GND #PWR010
U 1 1 5DBCA392
P 2050 3250
F 0 "#PWR010" H 2050 3250 30  0001 C CNN
F 1 "GND" H 2050 3180 30  0001 C CNN
F 2 "" H 2050 3250 60  0000 C CNN
F 3 "" H 2050 3250 60  0000 C CNN
	1    2050 3250
	0    1    1    0   
$EndComp
Text HLabel 1250 3750 0    60   Input ~ 0
VIN
Wire Wire Line
	2050 3250 2250 3250
Wire Wire Line
	1300 4450 1300 4550
Wire Wire Line
	1300 4350 1300 4450
Wire Wire Line
	1300 4250 1300 4350
Wire Wire Line
	1300 4150 1300 4250
Wire Wire Line
	1300 4050 1300 4150
Wire Wire Line
	1300 3950 1300 4050
Wire Wire Line
	1300 3850 1300 3950
Wire Wire Line
	1700 3950 2250 3950
$Comp
L Device:LED_ALT LED18
U 1 1 5DBCA3A8
P 1550 3950
F 0 "LED18" H 1950 3950 50  0000 C CNN
F 1 "LED_ALT" H 1543 3786 50  0001 C CNN
F 2 "lpa96_footprints:VLDx1232G" H 1550 3950 50  0001 C CNN
F 3 "~" H 1550 3950 50  0001 C CNN
	1    1550 3950
	-1   0    0    1   
$EndComp
$Comp
L Device:LED_ALT LED19
U 1 1 5DBCA3B2
P 1550 4050
F 0 "LED19" H 1950 4050 50  0000 C CNN
F 1 "LED_ALT" H 1543 3886 50  0001 C CNN
F 2 "lpa96_footprints:VLDx1232G" H 1550 4050 50  0001 C CNN
F 3 "~" H 1550 4050 50  0001 C CNN
	1    1550 4050
	-1   0    0    1   
$EndComp
Wire Wire Line
	1700 4050 2250 4050
$Comp
L Device:LED_ALT LED20
U 1 1 5DBCA3BD
P 1550 4150
F 0 "LED20" H 1950 4150 50  0000 C CNN
F 1 "LED_ALT" H 1543 3986 50  0001 C CNN
F 2 "lpa96_footprints:VLDx1232G" H 1550 4150 50  0001 C CNN
F 3 "~" H 1550 4150 50  0001 C CNN
	1    1550 4150
	-1   0    0    1   
$EndComp
$Comp
L Device:LED_ALT LED21
U 1 1 5DBCA3C7
P 1550 4250
F 0 "LED21" H 1950 4250 50  0000 C CNN
F 1 "LED_ALT" H 1543 4086 50  0001 C CNN
F 2 "lpa96_footprints:VLDx1232G" H 1550 4250 50  0001 C CNN
F 3 "~" H 1550 4250 50  0001 C CNN
	1    1550 4250
	-1   0    0    1   
$EndComp
$Comp
L Device:LED_ALT LED22
U 1 1 5DBCA3D1
P 1550 4350
F 0 "LED22" H 1950 4350 50  0000 C CNN
F 1 "LED_ALT" H 1543 4186 50  0001 C CNN
F 2 "lpa96_footprints:VLDx1232G" H 1550 4350 50  0001 C CNN
F 3 "~" H 1550 4350 50  0001 C CNN
	1    1550 4350
	-1   0    0    1   
$EndComp
$Comp
L Device:LED_ALT LED23
U 1 1 5DBCA3DB
P 1550 4450
F 0 "LED23" H 1950 4450 50  0000 C CNN
F 1 "LED_ALT" H 1543 4286 50  0001 C CNN
F 2 "lpa96_footprints:VLDx1232G" H 1550 4450 50  0001 C CNN
F 3 "~" H 1550 4450 50  0001 C CNN
	1    1550 4450
	-1   0    0    1   
$EndComp
$Comp
L Device:LED_ALT LED24
U 1 1 5DBCA3E5
P 1550 4550
F 0 "LED24" H 1950 4550 50  0000 C CNN
F 1 "LED_ALT" H 1543 4386 50  0001 C CNN
F 2 "lpa96_footprints:VLDx1232G" H 1550 4550 50  0001 C CNN
F 3 "~" H 1550 4550 50  0001 C CNN
	1    1550 4550
	-1   0    0    1   
$EndComp
Wire Wire Line
	1700 4150 2250 4150
Wire Wire Line
	1700 4250 2250 4250
Wire Wire Line
	1700 4350 2250 4350
Wire Wire Line
	1700 4450 2250 4450
Wire Wire Line
	1700 4550 2250 4550
Wire Wire Line
	1300 3750 1250 3750
Wire Wire Line
	1700 3850 2250 3850
$Comp
L Device:LED_ALT LED17
U 1 1 5DBCA3F6
P 1550 3850
F 0 "LED17" H 1950 3850 50  0000 C CNN
F 1 "LED_ALT" H 1543 3686 50  0001 C CNN
F 2 "lpa96_footprints:VLDx1232G" H 1550 3850 50  0001 C CNN
F 3 "~" H 1550 3850 50  0001 C CNN
	1    1550 3850
	-1   0    0    1   
$EndComp
Text HLabel 2100 3350 0    60   Input ~ 0
BLANK
Text HLabel 2100 3750 0    60   Input ~ 0
MODE
Text HLabel 2100 3550 0    60   Input ~ 0
SCLK
Text HLabel 2100 3450 0    60   Input ~ 0
XLAT
Wire Wire Line
	2250 3450 2100 3450
Wire Wire Line
	2250 3550 2100 3550
Wire Wire Line
	2250 3750 2100 3750
Wire Wire Line
	2100 3350 2250 3350
Wire Wire Line
	1650 2650 1650 3650
Wire Wire Line
	1650 3650 2250 3650
Wire Wire Line
	4450 3950 4350 3950
Wire Wire Line
	4450 4050 4350 4050
Wire Wire Line
	4450 4150 4350 4150
Wire Wire Line
	4450 4250 4350 4250
Wire Wire Line
	4450 4350 4350 4350
Wire Wire Line
	4450 4450 4350 4450
Wire Wire Line
	4450 4550 4350 4550
Wire Wire Line
	4350 3850 4450 3850
Wire Wire Line
	3750 3850 4050 3850
Wire Wire Line
	4050 3950 3750 3950
Wire Wire Line
	3750 4050 4050 4050
Wire Wire Line
	4050 4150 3750 4150
Wire Wire Line
	3750 4250 4050 4250
Wire Wire Line
	4050 4350 3750 4350
Wire Wire Line
	3750 4450 4050 4450
Wire Wire Line
	3750 4550 4050 4550
Connection ~ 4450 4450
Connection ~ 4450 4350
Connection ~ 4450 4250
Connection ~ 4450 4150
Connection ~ 4450 4050
Connection ~ 4450 3950
Connection ~ 4450 3850
Wire Wire Line
	4450 3750 4450 3850
Text HLabel 4500 3750 2    60   Input ~ 0
VIN
Wire Wire Line
	4450 4450 4450 4550
Wire Wire Line
	4450 4350 4450 4450
Wire Wire Line
	4450 4250 4450 4350
Wire Wire Line
	4450 4150 4450 4250
Wire Wire Line
	4450 4050 4450 4150
Wire Wire Line
	4450 3950 4450 4050
Wire Wire Line
	4450 3850 4450 3950
$Comp
L Device:LED_ALT LED32
U 1 1 5DCAB0A6
P 4200 3850
F 0 "LED32" H 4600 3850 50  0000 C CNN
F 1 "LED_ALT" H 4193 3686 50  0001 C CNN
F 2 "lpa96_footprints:VLDx1232G" H 4200 3850 50  0001 C CNN
F 3 "~" H 4200 3850 50  0001 C CNN
	1    4200 3850
	1    0    0    1   
$EndComp
$Comp
L Device:LED_ALT LED31
U 1 1 5DCAB0B0
P 4200 3950
F 0 "LED31" H 4600 3950 50  0000 C CNN
F 1 "LED_ALT" H 4193 3786 50  0001 C CNN
F 2 "lpa96_footprints:VLDx1232G" H 4200 3950 50  0001 C CNN
F 3 "~" H 4200 3950 50  0001 C CNN
	1    4200 3950
	1    0    0    1   
$EndComp
$Comp
L Device:LED_ALT LED30
U 1 1 5DCAB0BA
P 4200 4050
F 0 "LED30" H 4600 4050 50  0000 C CNN
F 1 "LED_ALT" H 4193 3886 50  0001 C CNN
F 2 "lpa96_footprints:VLDx1232G" H 4200 4050 50  0001 C CNN
F 3 "~" H 4200 4050 50  0001 C CNN
	1    4200 4050
	1    0    0    1   
$EndComp
$Comp
L Device:LED_ALT LED29
U 1 1 5DCAB0C4
P 4200 4150
F 0 "LED29" H 4600 4150 50  0000 C CNN
F 1 "LED_ALT" H 4193 3986 50  0001 C CNN
F 2 "lpa96_footprints:VLDx1232G" H 4200 4150 50  0001 C CNN
F 3 "~" H 4200 4150 50  0001 C CNN
	1    4200 4150
	1    0    0    1   
$EndComp
$Comp
L Device:LED_ALT LED28
U 1 1 5DCAB0CE
P 4200 4250
F 0 "LED28" H 4600 4250 50  0000 C CNN
F 1 "LED_ALT" H 4193 4086 50  0001 C CNN
F 2 "lpa96_footprints:VLDx1232G" H 4200 4250 50  0001 C CNN
F 3 "~" H 4200 4250 50  0001 C CNN
	1    4200 4250
	1    0    0    1   
$EndComp
$Comp
L Device:LED_ALT LED27
U 1 1 5DCAB0D8
P 4200 4350
F 0 "LED27" H 4600 4350 50  0000 C CNN
F 1 "LED_ALT" H 4193 4186 50  0001 C CNN
F 2 "lpa96_footprints:VLDx1232G" H 4200 4350 50  0001 C CNN
F 3 "~" H 4200 4350 50  0001 C CNN
	1    4200 4350
	1    0    0    1   
$EndComp
$Comp
L Device:LED_ALT LED26
U 1 1 5DCAB0E2
P 4200 4450
F 0 "LED26" H 4600 4450 50  0000 C CNN
F 1 "LED_ALT" H 4193 4286 50  0001 C CNN
F 2 "lpa96_footprints:VLDx1232G" H 4200 4450 50  0001 C CNN
F 3 "~" H 4200 4450 50  0001 C CNN
	1    4200 4450
	1    0    0    1   
$EndComp
$Comp
L Device:LED_ALT LED25
U 1 1 5DCAB0EC
P 4200 4550
F 0 "LED25" H 4600 4550 50  0000 C CNN
F 1 "LED_ALT" H 4193 4386 50  0001 C CNN
F 2 "lpa96_footprints:VLDx1232G" H 4200 4550 50  0001 C CNN
F 3 "~" H 4200 4550 50  0001 C CNN
	1    4200 4550
	1    0    0    1   
$EndComp
Wire Wire Line
	4450 3750 4500 3750
Wire Wire Line
	1300 6900 1400 6900
Wire Wire Line
	1300 6800 1400 6800
Wire Wire Line
	1300 6700 1400 6700
Wire Wire Line
	1300 6600 1400 6600
Wire Wire Line
	1300 6500 1400 6500
Wire Wire Line
	1300 6400 1400 6400
Wire Wire Line
	1300 6300 1400 6300
Wire Wire Line
	1400 6200 1300 6200
Connection ~ 1300 6800
Connection ~ 1300 6700
Connection ~ 1300 6600
Connection ~ 1300 6500
Connection ~ 1300 6400
Connection ~ 1300 6300
Connection ~ 1300 6200
Wire Wire Line
	1300 6100 1300 6200
Text HLabel 1250 6100 0    60   Input ~ 0
VIN
Wire Wire Line
	1300 6800 1300 6900
Wire Wire Line
	1300 6700 1300 6800
Wire Wire Line
	1300 6600 1300 6700
Wire Wire Line
	1300 6500 1300 6600
Wire Wire Line
	1300 6400 1300 6500
Wire Wire Line
	1300 6300 1300 6400
Wire Wire Line
	1300 6200 1300 6300
Wire Wire Line
	1700 6300 2250 6300
$Comp
L Device:LED_ALT LED35
U 1 1 5DE22884
P 1550 6400
F 0 "LED35" H 1950 6400 50  0000 C CNN
F 1 "LED_ALT" H 1543 6236 50  0001 C CNN
F 2 "lpa96_footprints:VLDx1232G" H 1550 6400 50  0001 C CNN
F 3 "~" H 1550 6400 50  0001 C CNN
	1    1550 6400
	-1   0    0    1   
$EndComp
Wire Wire Line
	1700 6400 2250 6400
$Comp
L Device:LED_ALT LED36
U 1 1 5DE2288F
P 1550 6500
F 0 "LED36" H 1950 6500 50  0000 C CNN
F 1 "LED_ALT" H 1543 6336 50  0001 C CNN
F 2 "lpa96_footprints:VLDx1232G" H 1550 6500 50  0001 C CNN
F 3 "~" H 1550 6500 50  0001 C CNN
	1    1550 6500
	-1   0    0    1   
$EndComp
$Comp
L Device:LED_ALT LED37
U 1 1 5DE22899
P 1550 6600
F 0 "LED37" H 1950 6600 50  0000 C CNN
F 1 "LED_ALT" H 1543 6436 50  0001 C CNN
F 2 "lpa96_footprints:VLDx1232G" H 1550 6600 50  0001 C CNN
F 3 "~" H 1550 6600 50  0001 C CNN
	1    1550 6600
	-1   0    0    1   
$EndComp
$Comp
L Device:LED_ALT LED38
U 1 1 5DE228A3
P 1550 6700
F 0 "LED38" H 1950 6700 50  0000 C CNN
F 1 "LED_ALT" H 1543 6536 50  0001 C CNN
F 2 "lpa96_footprints:VLDx1232G" H 1550 6700 50  0001 C CNN
F 3 "~" H 1550 6700 50  0001 C CNN
	1    1550 6700
	-1   0    0    1   
$EndComp
$Comp
L Device:LED_ALT LED39
U 1 1 5DE228AD
P 1550 6800
F 0 "LED39" H 1950 6800 50  0000 C CNN
F 1 "LED_ALT" H 1543 6636 50  0001 C CNN
F 2 "lpa96_footprints:VLDx1232G" H 1550 6800 50  0001 C CNN
F 3 "~" H 1550 6800 50  0001 C CNN
	1    1550 6800
	-1   0    0    1   
$EndComp
$Comp
L Device:LED_ALT LED40
U 1 1 5DE228B7
P 1550 6900
F 0 "LED40" H 1950 6900 50  0000 C CNN
F 1 "LED_ALT" H 1543 6736 50  0001 C CNN
F 2 "lpa96_footprints:VLDx1232G" H 1550 6900 50  0001 C CNN
F 3 "~" H 1550 6900 50  0001 C CNN
	1    1550 6900
	-1   0    0    1   
$EndComp
Wire Wire Line
	1700 6500 2250 6500
Wire Wire Line
	1700 6600 2250 6600
Wire Wire Line
	1700 6700 2250 6700
Wire Wire Line
	1700 6800 2250 6800
Wire Wire Line
	1700 6900 2250 6900
Wire Wire Line
	1300 6100 1250 6100
Wire Wire Line
	1700 6200 2250 6200
Text HLabel 2100 5700 0    60   Input ~ 0
BLANK
Text HLabel 2100 6100 0    60   Input ~ 0
MODE
Text HLabel 2100 5900 0    60   Input ~ 0
SCLK
Text HLabel 2100 5800 0    60   Input ~ 0
XLAT
Wire Wire Line
	2250 5800 2100 5800
Wire Wire Line
	2250 5900 2100 5900
Wire Wire Line
	2250 6100 2100 6100
Wire Wire Line
	2100 5700 2250 5700
Wire Wire Line
	1650 6000 2250 6000
Wire Wire Line
	1650 4950 1650 6000
Wire Wire Line
	4450 6300 4350 6300
Wire Wire Line
	4450 6400 4350 6400
Wire Wire Line
	4450 6500 4350 6500
Wire Wire Line
	4450 6600 4350 6600
Wire Wire Line
	4450 6700 4350 6700
Wire Wire Line
	4450 6800 4350 6800
Wire Wire Line
	4450 6900 4350 6900
Wire Wire Line
	4350 6200 4450 6200
Wire Wire Line
	3750 6200 4050 6200
Wire Wire Line
	4050 6300 3750 6300
Wire Wire Line
	3750 6400 4050 6400
Wire Wire Line
	4050 6500 3750 6500
Wire Wire Line
	3750 6600 4050 6600
Wire Wire Line
	4050 6700 3750 6700
Wire Wire Line
	3750 6800 4050 6800
Wire Wire Line
	3750 6900 4050 6900
Connection ~ 4450 6800
Connection ~ 4450 6700
Connection ~ 4450 6600
Connection ~ 4450 6500
Connection ~ 4450 6400
Connection ~ 4450 6300
Connection ~ 4450 6200
Wire Wire Line
	4450 6100 4450 6200
Text HLabel 4500 6100 2    60   Input ~ 0
VIN
Wire Wire Line
	4450 6800 4450 6900
Wire Wire Line
	4450 6700 4450 6800
Wire Wire Line
	4450 6600 4450 6700
Wire Wire Line
	4450 6500 4450 6600
Wire Wire Line
	4450 6400 4450 6500
Wire Wire Line
	4450 6300 4450 6400
Wire Wire Line
	4450 6200 4450 6300
$Comp
L Device:LED_ALT LED48
U 1 1 5DE987AB
P 4200 6200
F 0 "LED48" H 4600 6200 50  0000 C CNN
F 1 "LED_ALT" H 4193 6036 50  0001 C CNN
F 2 "lpa96_footprints:VLDx1232G" H 4200 6200 50  0001 C CNN
F 3 "~" H 4200 6200 50  0001 C CNN
	1    4200 6200
	1    0    0    1   
$EndComp
$Comp
L Device:LED_ALT LED47
U 1 1 5DE987B5
P 4200 6300
F 0 "LED47" H 4600 6300 50  0000 C CNN
F 1 "LED_ALT" H 4193 6136 50  0001 C CNN
F 2 "lpa96_footprints:VLDx1232G" H 4200 6300 50  0001 C CNN
F 3 "~" H 4200 6300 50  0001 C CNN
	1    4200 6300
	1    0    0    1   
$EndComp
$Comp
L Device:LED_ALT LED46
U 1 1 5DE987BF
P 4200 6400
F 0 "LED46" H 4600 6400 50  0000 C CNN
F 1 "LED_ALT" H 4193 6236 50  0001 C CNN
F 2 "lpa96_footprints:VLDx1232G" H 4200 6400 50  0001 C CNN
F 3 "~" H 4200 6400 50  0001 C CNN
	1    4200 6400
	1    0    0    1   
$EndComp
$Comp
L Device:LED_ALT LED45
U 1 1 5DE987C9
P 4200 6500
F 0 "LED45" H 4600 6500 50  0000 C CNN
F 1 "LED_ALT" H 4193 6336 50  0001 C CNN
F 2 "lpa96_footprints:VLDx1232G" H 4200 6500 50  0001 C CNN
F 3 "~" H 4200 6500 50  0001 C CNN
	1    4200 6500
	1    0    0    1   
$EndComp
$Comp
L Device:LED_ALT LED44
U 1 1 5DE987D3
P 4200 6600
F 0 "LED44" H 4600 6600 50  0000 C CNN
F 1 "LED_ALT" H 4193 6436 50  0001 C CNN
F 2 "lpa96_footprints:VLDx1232G" H 4200 6600 50  0001 C CNN
F 3 "~" H 4200 6600 50  0001 C CNN
	1    4200 6600
	1    0    0    1   
$EndComp
$Comp
L Device:LED_ALT LED43
U 1 1 5DE987DD
P 4200 6700
F 0 "LED43" H 4600 6700 50  0000 C CNN
F 1 "LED_ALT" H 4193 6536 50  0001 C CNN
F 2 "lpa96_footprints:VLDx1232G" H 4200 6700 50  0001 C CNN
F 3 "~" H 4200 6700 50  0001 C CNN
	1    4200 6700
	1    0    0    1   
$EndComp
$Comp
L Device:LED_ALT LED42
U 1 1 5DE987E7
P 4200 6800
F 0 "LED42" H 4600 6800 50  0000 C CNN
F 1 "LED_ALT" H 4193 6636 50  0001 C CNN
F 2 "lpa96_footprints:VLDx1232G" H 4200 6800 50  0001 C CNN
F 3 "~" H 4200 6800 50  0001 C CNN
	1    4200 6800
	1    0    0    1   
$EndComp
$Comp
L Device:LED_ALT LED41
U 1 1 5DE987F1
P 4200 6900
F 0 "LED41" H 4600 6900 50  0000 C CNN
F 1 "LED_ALT" H 4193 6736 50  0001 C CNN
F 2 "lpa96_footprints:VLDx1232G" H 4200 6900 50  0001 C CNN
F 3 "~" H 4200 6900 50  0001 C CNN
	1    4200 6900
	1    0    0    1   
$EndComp
Wire Wire Line
	4450 6100 4500 6100
Wire Wire Line
	10150 2700 10150 2550
Wire Wire Line
	10000 2550 10150 2550
Wire Wire Line
	9400 2950 9600 2950
Wire Wire Line
	9400 2950 9400 3150
Text HLabel 9500 3250 2    60   Input ~ 0
GSCLK
$Comp
L Device:R R7
U 1 1 53630EC3
P 9750 3050
F 0 "R7" V 9830 3050 40  0000 C CNN
F 1 "2.2K" V 9650 3050 40  0000 C CNN
F 2 "Resistors_SMD:R_0805" V 9680 3050 30  0001 C CNN
F 3 "~" H 9750 3050 30  0000 C CNN
	1    9750 3050
	0    1    1    0   
$EndComp
NoConn ~ 9300 3450
Wire Wire Line
	9600 2550 10000 2550
Wire Wire Line
	9300 2950 9400 2950
Connection ~ 10000 2550
Wire Wire Line
	9300 3250 9500 3250
Wire Wire Line
	10000 3050 10000 2550
Wire Wire Line
	9400 3150 9300 3150
Connection ~ 9400 2950
Wire Wire Line
	9300 3350 10750 3350
Wire Wire Line
	6850 2250 6950 2250
Wire Wire Line
	6850 2150 6950 2150
Wire Wire Line
	6850 2050 6950 2050
Wire Wire Line
	6850 1950 6950 1950
Wire Wire Line
	6850 1850 6950 1850
Wire Wire Line
	6850 1750 6950 1750
Wire Wire Line
	6850 1650 6950 1650
Wire Wire Line
	6950 1550 6850 1550
Connection ~ 6850 2150
Connection ~ 6850 2050
Connection ~ 6850 1950
Connection ~ 6850 1850
Connection ~ 6850 1750
Connection ~ 6850 1650
Connection ~ 6850 1550
Wire Wire Line
	6850 1450 6850 1550
$Comp
L power:GND #PWR014
U 1 1 5D9616E2
P 7600 950
F 0 "#PWR014" H 7600 950 30  0001 C CNN
F 1 "GND" H 7600 880 30  0001 C CNN
F 2 "" H 7600 950 60  0000 C CNN
F 3 "" H 7600 950 60  0000 C CNN
	1    7600 950 
	0    1    1    0   
$EndComp
Text HLabel 6800 1450 0    60   Input ~ 0
VIN
Wire Wire Line
	7600 950  7800 950 
Wire Wire Line
	6850 2150 6850 2250
Wire Wire Line
	6850 2050 6850 2150
Wire Wire Line
	6850 1950 6850 2050
Wire Wire Line
	6850 1850 6850 1950
Wire Wire Line
	6850 1750 6850 1850
Wire Wire Line
	6850 1650 6850 1750
Wire Wire Line
	6850 1550 6850 1650
Wire Wire Line
	7250 1650 7800 1650
$Comp
L Device:LED_ALT LED50
U 1 1 5D9616F6
P 7100 1650
F 0 "LED50" H 7500 1650 50  0000 C CNN
F 1 "LED_ALT" H 7093 1486 50  0001 C CNN
F 2 "lpa96_footprints:VLDx1232G" H 7100 1650 50  0001 C CNN
F 3 "~" H 7100 1650 50  0001 C CNN
	1    7100 1650
	-1   0    0    1   
$EndComp
$Comp
L Device:LED_ALT LED51
U 1 1 5D961700
P 7100 1750
F 0 "LED51" H 7500 1750 50  0000 C CNN
F 1 "LED_ALT" H 7093 1586 50  0001 C CNN
F 2 "lpa96_footprints:VLDx1232G" H 7100 1750 50  0001 C CNN
F 3 "~" H 7100 1750 50  0001 C CNN
	1    7100 1750
	-1   0    0    1   
$EndComp
Wire Wire Line
	7250 1750 7800 1750
$Comp
L Device:LED_ALT LED52
U 1 1 5D96170B
P 7100 1850
F 0 "LED52" H 7500 1850 50  0000 C CNN
F 1 "LED_ALT" H 7093 1686 50  0001 C CNN
F 2 "lpa96_footprints:VLDx1232G" H 7100 1850 50  0001 C CNN
F 3 "~" H 7100 1850 50  0001 C CNN
	1    7100 1850
	-1   0    0    1   
$EndComp
$Comp
L Device:LED_ALT LED53
U 1 1 5D961715
P 7100 1950
F 0 "LED53" H 7500 1950 50  0000 C CNN
F 1 "LED_ALT" H 7093 1786 50  0001 C CNN
F 2 "lpa96_footprints:VLDx1232G" H 7100 1950 50  0001 C CNN
F 3 "~" H 7100 1950 50  0001 C CNN
	1    7100 1950
	-1   0    0    1   
$EndComp
$Comp
L Device:LED_ALT LED54
U 1 1 5D96171F
P 7100 2050
F 0 "LED54" H 7500 2050 50  0000 C CNN
F 1 "LED_ALT" H 7093 1886 50  0001 C CNN
F 2 "lpa96_footprints:VLDx1232G" H 7100 2050 50  0001 C CNN
F 3 "~" H 7100 2050 50  0001 C CNN
	1    7100 2050
	-1   0    0    1   
$EndComp
$Comp
L Device:LED_ALT LED55
U 1 1 5D961729
P 7100 2150
F 0 "LED55" H 7500 2150 50  0000 C CNN
F 1 "LED_ALT" H 7093 1986 50  0001 C CNN
F 2 "lpa96_footprints:VLDx1232G" H 7100 2150 50  0001 C CNN
F 3 "~" H 7100 2150 50  0001 C CNN
	1    7100 2150
	-1   0    0    1   
$EndComp
$Comp
L Device:LED_ALT LED56
U 1 1 5D961733
P 7100 2250
F 0 "LED56" H 7500 2250 50  0000 C CNN
F 1 "LED_ALT" H 7093 2086 50  0001 C CNN
F 2 "lpa96_footprints:VLDx1232G" H 7100 2250 50  0001 C CNN
F 3 "~" H 7100 2250 50  0001 C CNN
	1    7100 2250
	-1   0    0    1   
$EndComp
Wire Wire Line
	7250 1850 7800 1850
Wire Wire Line
	7250 1950 7800 1950
Wire Wire Line
	7250 2050 7800 2050
Wire Wire Line
	7250 2150 7800 2150
Wire Wire Line
	7250 2250 7800 2250
Wire Wire Line
	6850 1450 6800 1450
Wire Wire Line
	7250 1550 7800 1550
$Comp
L Device:LED_ALT LED49
U 1 1 5D961744
P 7100 1550
F 0 "LED49" H 7500 1550 50  0000 C CNN
F 1 "LED_ALT" H 7093 1386 50  0001 C CNN
F 2 "lpa96_footprints:VLDx1232G" H 7100 1550 50  0001 C CNN
F 3 "~" H 7100 1550 50  0001 C CNN
	1    7100 1550
	-1   0    0    1   
$EndComp
Text HLabel 7650 1050 0    60   Input ~ 0
BLANK
Text HLabel 7650 1450 0    60   Input ~ 0
MODE
Text HLabel 7650 1250 0    60   Input ~ 0
SCLK
Text HLabel 7650 1150 0    60   Input ~ 0
XLAT
Wire Wire Line
	7800 1150 7650 1150
Wire Wire Line
	7800 1250 7650 1250
Wire Wire Line
	7800 1450 7650 1450
Wire Wire Line
	7650 1050 7800 1050
Wire Wire Line
	10000 1650 9900 1650
Wire Wire Line
	10000 1750 9900 1750
Wire Wire Line
	10000 1850 9900 1850
Wire Wire Line
	10000 1950 9900 1950
Wire Wire Line
	10000 2050 9900 2050
Wire Wire Line
	10000 2150 9900 2150
Wire Wire Line
	10000 2250 9900 2250
Wire Wire Line
	9900 1550 10000 1550
Wire Wire Line
	9300 1550 9600 1550
Wire Wire Line
	9600 1650 9300 1650
Wire Wire Line
	9300 1750 9600 1750
Wire Wire Line
	9600 1850 9300 1850
Wire Wire Line
	9300 1950 9600 1950
Wire Wire Line
	9600 2050 9300 2050
Wire Wire Line
	9300 2150 9600 2150
Wire Wire Line
	9300 2250 9600 2250
Connection ~ 10000 2150
Connection ~ 10000 2050
Connection ~ 10000 1950
Connection ~ 10000 1850
Connection ~ 10000 1750
Connection ~ 10000 1650
Connection ~ 10000 1550
Wire Wire Line
	10000 1450 10000 1550
Text HLabel 10050 1450 2    60   Input ~ 0
VIN
Wire Wire Line
	10000 2150 10000 2250
Wire Wire Line
	10000 2050 10000 2150
Wire Wire Line
	10000 1950 10000 2050
Wire Wire Line
	10000 1850 10000 1950
Wire Wire Line
	10000 1750 10000 1850
Wire Wire Line
	10000 1650 10000 1750
Wire Wire Line
	10000 1550 10000 1650
$Comp
L Device:LED_ALT LED64
U 1 1 5D98E032
P 9750 1550
F 0 "LED64" H 10150 1550 50  0000 C CNN
F 1 "LED_ALT" H 9743 1386 50  0001 C CNN
F 2 "lpa96_footprints:VLDx1232G" H 9750 1550 50  0001 C CNN
F 3 "~" H 9750 1550 50  0001 C CNN
	1    9750 1550
	1    0    0    1   
$EndComp
$Comp
L Device:LED_ALT LED63
U 1 1 5D98E03C
P 9750 1650
F 0 "LED63" H 10150 1650 50  0000 C CNN
F 1 "LED_ALT" H 9743 1486 50  0001 C CNN
F 2 "lpa96_footprints:VLDx1232G" H 9750 1650 50  0001 C CNN
F 3 "~" H 9750 1650 50  0001 C CNN
	1    9750 1650
	1    0    0    1   
$EndComp
$Comp
L Device:LED_ALT LED62
U 1 1 5D98E046
P 9750 1750
F 0 "LED62" H 10150 1750 50  0000 C CNN
F 1 "LED_ALT" H 9743 1586 50  0001 C CNN
F 2 "lpa96_footprints:VLDx1232G" H 9750 1750 50  0001 C CNN
F 3 "~" H 9750 1750 50  0001 C CNN
	1    9750 1750
	1    0    0    1   
$EndComp
$Comp
L Device:LED_ALT LED61
U 1 1 5D98E050
P 9750 1850
F 0 "LED61" H 10150 1850 50  0000 C CNN
F 1 "LED_ALT" H 9743 1686 50  0001 C CNN
F 2 "lpa96_footprints:VLDx1232G" H 9750 1850 50  0001 C CNN
F 3 "~" H 9750 1850 50  0001 C CNN
	1    9750 1850
	1    0    0    1   
$EndComp
$Comp
L Device:LED_ALT LED60
U 1 1 5D98E05A
P 9750 1950
F 0 "LED60" H 10150 1950 50  0000 C CNN
F 1 "LED_ALT" H 9743 1786 50  0001 C CNN
F 2 "lpa96_footprints:VLDx1232G" H 9750 1950 50  0001 C CNN
F 3 "~" H 9750 1950 50  0001 C CNN
	1    9750 1950
	1    0    0    1   
$EndComp
$Comp
L Device:LED_ALT LED59
U 1 1 5D98E064
P 9750 2050
F 0 "LED59" H 10150 2050 50  0000 C CNN
F 1 "LED_ALT" H 9743 1886 50  0001 C CNN
F 2 "lpa96_footprints:VLDx1232G" H 9750 2050 50  0001 C CNN
F 3 "~" H 9750 2050 50  0001 C CNN
	1    9750 2050
	1    0    0    1   
$EndComp
$Comp
L Device:LED_ALT LED58
U 1 1 5D98E06E
P 9750 2150
F 0 "LED58" H 10150 2150 50  0000 C CNN
F 1 "LED_ALT" H 9743 1986 50  0001 C CNN
F 2 "lpa96_footprints:VLDx1232G" H 9750 2150 50  0001 C CNN
F 3 "~" H 9750 2150 50  0001 C CNN
	1    9750 2150
	1    0    0    1   
$EndComp
$Comp
L Device:LED_ALT LED57
U 1 1 5D98E078
P 9750 2250
F 0 "LED57" H 10150 2250 50  0000 C CNN
F 1 "LED_ALT" H 9743 2086 50  0001 C CNN
F 2 "lpa96_footprints:VLDx1232G" H 9750 2250 50  0001 C CNN
F 3 "~" H 9750 2250 50  0001 C CNN
	1    9750 2250
	1    0    0    1   
$EndComp
Wire Wire Line
	10000 1450 10050 1450
Wire Wire Line
	6850 4250 6950 4250
Wire Wire Line
	6850 4150 6950 4150
Wire Wire Line
	6850 4050 6950 4050
Wire Wire Line
	6850 3950 6950 3950
Wire Wire Line
	6850 3850 6950 3850
Wire Wire Line
	6850 3750 6950 3750
Wire Wire Line
	6850 3650 6950 3650
Wire Wire Line
	6950 3550 6850 3550
Connection ~ 6850 4150
Connection ~ 6850 4050
Connection ~ 6850 3950
Connection ~ 6850 3850
Connection ~ 6850 3750
Connection ~ 6850 3650
Connection ~ 6850 3550
Wire Wire Line
	6850 3450 6850 3550
$Comp
L power:GND #PWR016
U 1 1 5D9F850C
P 7600 2950
F 0 "#PWR016" H 7600 2950 30  0001 C CNN
F 1 "GND" H 7600 2880 30  0001 C CNN
F 2 "" H 7600 2950 60  0000 C CNN
F 3 "" H 7600 2950 60  0000 C CNN
	1    7600 2950
	0    1    1    0   
$EndComp
Text HLabel 6800 3450 0    60   Input ~ 0
VIN
Wire Wire Line
	7600 2950 7800 2950
Wire Wire Line
	6850 4150 6850 4250
Wire Wire Line
	6850 4050 6850 4150
Wire Wire Line
	6850 3950 6850 4050
Wire Wire Line
	6850 3850 6850 3950
Wire Wire Line
	6850 3750 6850 3850
Wire Wire Line
	6850 3650 6850 3750
Wire Wire Line
	6850 3550 6850 3650
Wire Wire Line
	7250 3650 7800 3650
$Comp
L Device:LED_ALT LED66
U 1 1 5D9F8520
P 7100 3650
F 0 "LED66" H 7500 3650 50  0000 C CNN
F 1 "LED_ALT" H 7093 3486 50  0001 C CNN
F 2 "lpa96_footprints:VLDx1232G" H 7100 3650 50  0001 C CNN
F 3 "~" H 7100 3650 50  0001 C CNN
	1    7100 3650
	-1   0    0    1   
$EndComp
$Comp
L Device:LED_ALT LED67
U 1 1 5D9F852A
P 7100 3750
F 0 "LED67" H 7500 3750 50  0000 C CNN
F 1 "LED_ALT" H 7093 3586 50  0001 C CNN
F 2 "lpa96_footprints:VLDx1232G" H 7100 3750 50  0001 C CNN
F 3 "~" H 7100 3750 50  0001 C CNN
	1    7100 3750
	-1   0    0    1   
$EndComp
Wire Wire Line
	7250 3750 7800 3750
$Comp
L Device:LED_ALT LED68
U 1 1 5D9F8535
P 7100 3850
F 0 "LED68" H 7500 3850 50  0000 C CNN
F 1 "LED_ALT" H 7093 3686 50  0001 C CNN
F 2 "lpa96_footprints:VLDx1232G" H 7100 3850 50  0001 C CNN
F 3 "~" H 7100 3850 50  0001 C CNN
	1    7100 3850
	-1   0    0    1   
$EndComp
$Comp
L Device:LED_ALT LED69
U 1 1 5D9F853F
P 7100 3950
F 0 "LED69" H 7500 3950 50  0000 C CNN
F 1 "LED_ALT" H 7093 3786 50  0001 C CNN
F 2 "lpa96_footprints:VLDx1232G" H 7100 3950 50  0001 C CNN
F 3 "~" H 7100 3950 50  0001 C CNN
	1    7100 3950
	-1   0    0    1   
$EndComp
$Comp
L Device:LED_ALT LED70
U 1 1 5D9F8549
P 7100 4050
F 0 "LED70" H 7500 4050 50  0000 C CNN
F 1 "LED_ALT" H 7093 3886 50  0001 C CNN
F 2 "lpa96_footprints:VLDx1232G" H 7100 4050 50  0001 C CNN
F 3 "~" H 7100 4050 50  0001 C CNN
	1    7100 4050
	-1   0    0    1   
$EndComp
$Comp
L Device:LED_ALT LED71
U 1 1 5D9F8553
P 7100 4150
F 0 "LED71" H 7500 4150 50  0000 C CNN
F 1 "LED_ALT" H 7093 3986 50  0001 C CNN
F 2 "lpa96_footprints:VLDx1232G" H 7100 4150 50  0001 C CNN
F 3 "~" H 7100 4150 50  0001 C CNN
	1    7100 4150
	-1   0    0    1   
$EndComp
$Comp
L Device:LED_ALT LED72
U 1 1 5D9F855D
P 7100 4250
F 0 "LED72" H 7500 4250 50  0000 C CNN
F 1 "LED_ALT" H 7093 4086 50  0001 C CNN
F 2 "lpa96_footprints:VLDx1232G" H 7100 4250 50  0001 C CNN
F 3 "~" H 7100 4250 50  0001 C CNN
	1    7100 4250
	-1   0    0    1   
$EndComp
Wire Wire Line
	7250 3850 7800 3850
Wire Wire Line
	7250 3950 7800 3950
Wire Wire Line
	7250 4050 7800 4050
Wire Wire Line
	7250 4150 7800 4150
Wire Wire Line
	7250 4250 7800 4250
Wire Wire Line
	6850 3450 6800 3450
Wire Wire Line
	7250 3550 7800 3550
$Comp
L Device:LED_ALT LED65
U 1 1 5D9F856E
P 7100 3550
F 0 "LED65" H 7500 3550 50  0000 C CNN
F 1 "LED_ALT" H 7093 3386 50  0001 C CNN
F 2 "lpa96_footprints:VLDx1232G" H 7100 3550 50  0001 C CNN
F 3 "~" H 7100 3550 50  0001 C CNN
	1    7100 3550
	-1   0    0    1   
$EndComp
Text HLabel 7650 3050 0    60   Input ~ 0
BLANK
Text HLabel 7650 3450 0    60   Input ~ 0
MODE
Text HLabel 7650 3250 0    60   Input ~ 0
SCLK
Text HLabel 7650 3150 0    60   Input ~ 0
XLAT
Wire Wire Line
	7800 3150 7650 3150
Wire Wire Line
	7800 3250 7650 3250
Wire Wire Line
	7800 3450 7650 3450
Wire Wire Line
	7650 3050 7800 3050
Wire Wire Line
	7200 3350 7800 3350
Wire Wire Line
	10000 3650 9900 3650
Wire Wire Line
	10000 3750 9900 3750
Wire Wire Line
	10000 3850 9900 3850
Wire Wire Line
	10000 3950 9900 3950
Wire Wire Line
	10000 4050 9900 4050
Wire Wire Line
	10000 4150 9900 4150
Wire Wire Line
	10000 4250 9900 4250
Wire Wire Line
	9900 3550 10000 3550
Wire Wire Line
	9300 3550 9600 3550
Wire Wire Line
	9600 3650 9300 3650
Wire Wire Line
	9300 3750 9600 3750
Wire Wire Line
	9600 3850 9300 3850
Wire Wire Line
	9300 3950 9600 3950
Wire Wire Line
	9600 4050 9300 4050
Wire Wire Line
	9300 4150 9600 4150
Wire Wire Line
	9300 4250 9600 4250
Connection ~ 10000 4150
Connection ~ 10000 4050
Connection ~ 10000 3950
Connection ~ 10000 3850
Connection ~ 10000 3750
Connection ~ 10000 3650
Connection ~ 10000 3550
Wire Wire Line
	10000 3450 10000 3550
Text HLabel 10050 3450 2    60   Input ~ 0
VIN
Wire Wire Line
	10000 4150 10000 4250
Wire Wire Line
	10000 4050 10000 4150
Wire Wire Line
	10000 3950 10000 4050
Wire Wire Line
	10000 3850 10000 3950
Wire Wire Line
	10000 3750 10000 3850
Wire Wire Line
	10000 3650 10000 3750
Wire Wire Line
	10000 3550 10000 3650
$Comp
L Device:LED_ALT LED80
U 1 1 5DA21EC4
P 9750 3550
F 0 "LED80" H 10150 3550 50  0000 C CNN
F 1 "LED_ALT" H 9743 3386 50  0001 C CNN
F 2 "lpa96_footprints:VLDx1232G" H 9750 3550 50  0001 C CNN
F 3 "~" H 9750 3550 50  0001 C CNN
	1    9750 3550
	1    0    0    1   
$EndComp
$Comp
L Device:LED_ALT LED79
U 1 1 5DA21ECE
P 9750 3650
F 0 "LED79" H 10150 3650 50  0000 C CNN
F 1 "LED_ALT" H 9743 3486 50  0001 C CNN
F 2 "lpa96_footprints:VLDx1232G" H 9750 3650 50  0001 C CNN
F 3 "~" H 9750 3650 50  0001 C CNN
	1    9750 3650
	1    0    0    1   
$EndComp
$Comp
L Device:LED_ALT LED78
U 1 1 5DA21ED8
P 9750 3750
F 0 "LED78" H 10150 3750 50  0000 C CNN
F 1 "LED_ALT" H 9743 3586 50  0001 C CNN
F 2 "lpa96_footprints:VLDx1232G" H 9750 3750 50  0001 C CNN
F 3 "~" H 9750 3750 50  0001 C CNN
	1    9750 3750
	1    0    0    1   
$EndComp
$Comp
L Device:LED_ALT LED77
U 1 1 5DA21EE2
P 9750 3850
F 0 "LED77" H 10150 3850 50  0000 C CNN
F 1 "LED_ALT" H 9743 3686 50  0001 C CNN
F 2 "lpa96_footprints:VLDx1232G" H 9750 3850 50  0001 C CNN
F 3 "~" H 9750 3850 50  0001 C CNN
	1    9750 3850
	1    0    0    1   
$EndComp
$Comp
L Device:LED_ALT LED76
U 1 1 5DA21EEC
P 9750 3950
F 0 "LED76" H 10150 3950 50  0000 C CNN
F 1 "LED_ALT" H 9743 3786 50  0001 C CNN
F 2 "lpa96_footprints:VLDx1232G" H 9750 3950 50  0001 C CNN
F 3 "~" H 9750 3950 50  0001 C CNN
	1    9750 3950
	1    0    0    1   
$EndComp
$Comp
L Device:LED_ALT LED75
U 1 1 5DA21EF6
P 9750 4050
F 0 "LED75" H 10150 4050 50  0000 C CNN
F 1 "LED_ALT" H 9743 3886 50  0001 C CNN
F 2 "lpa96_footprints:VLDx1232G" H 9750 4050 50  0001 C CNN
F 3 "~" H 9750 4050 50  0001 C CNN
	1    9750 4050
	1    0    0    1   
$EndComp
$Comp
L Device:LED_ALT LED74
U 1 1 5DA21F00
P 9750 4150
F 0 "LED74" H 10150 4150 50  0000 C CNN
F 1 "LED_ALT" H 9743 3986 50  0001 C CNN
F 2 "lpa96_footprints:VLDx1232G" H 9750 4150 50  0001 C CNN
F 3 "~" H 9750 4150 50  0001 C CNN
	1    9750 4150
	1    0    0    1   
$EndComp
$Comp
L Device:LED_ALT LED73
U 1 1 5DA21F0A
P 9750 4250
F 0 "LED73" H 10150 4250 50  0000 C CNN
F 1 "LED_ALT" H 9743 4086 50  0001 C CNN
F 2 "lpa96_footprints:VLDx1232G" H 9750 4250 50  0001 C CNN
F 3 "~" H 9750 4250 50  0001 C CNN
	1    9750 4250
	1    0    0    1   
$EndComp
Wire Wire Line
	10000 3450 10050 3450
Wire Wire Line
	6850 6250 6950 6250
Wire Wire Line
	6850 6150 6950 6150
Wire Wire Line
	6850 6050 6950 6050
Wire Wire Line
	6850 5950 6950 5950
Wire Wire Line
	6850 5850 6950 5850
Wire Wire Line
	6850 5750 6950 5750
Wire Wire Line
	6850 5650 6950 5650
Wire Wire Line
	6950 5550 6850 5550
Connection ~ 6850 6150
Connection ~ 6850 6050
Connection ~ 6850 5950
Connection ~ 6850 5850
Connection ~ 6850 5750
Connection ~ 6850 5650
Connection ~ 6850 5550
Wire Wire Line
	6850 5450 6850 5550
$Comp
L power:GND #PWR018
U 1 1 5DAA6638
P 7600 4950
F 0 "#PWR018" H 7600 4950 30  0001 C CNN
F 1 "GND" H 7600 4880 30  0001 C CNN
F 2 "" H 7600 4950 60  0000 C CNN
F 3 "" H 7600 4950 60  0000 C CNN
	1    7600 4950
	0    1    1    0   
$EndComp
Text HLabel 6800 5450 0    60   Input ~ 0
VIN
Wire Wire Line
	7600 4950 7800 4950
Wire Wire Line
	6850 6150 6850 6250
Wire Wire Line
	6850 6050 6850 6150
Wire Wire Line
	6850 5950 6850 6050
Wire Wire Line
	6850 5850 6850 5950
Wire Wire Line
	6850 5750 6850 5850
Wire Wire Line
	6850 5650 6850 5750
Wire Wire Line
	6850 5550 6850 5650
Wire Wire Line
	7250 5650 7800 5650
$Comp
L Device:LED_ALT LED82
U 1 1 5DAA664C
P 7100 5650
F 0 "LED82" H 7500 5650 50  0000 C CNN
F 1 "LED_ALT" H 7093 5486 50  0001 C CNN
F 2 "lpa96_footprints:VLDx1232G" H 7100 5650 50  0001 C CNN
F 3 "~" H 7100 5650 50  0001 C CNN
	1    7100 5650
	-1   0    0    1   
$EndComp
$Comp
L Device:LED_ALT LED83
U 1 1 5DAA6656
P 7100 5750
F 0 "LED83" H 7500 5750 50  0000 C CNN
F 1 "LED_ALT" H 7093 5586 50  0001 C CNN
F 2 "lpa96_footprints:VLDx1232G" H 7100 5750 50  0001 C CNN
F 3 "~" H 7100 5750 50  0001 C CNN
	1    7100 5750
	-1   0    0    1   
$EndComp
Wire Wire Line
	7250 5750 7800 5750
$Comp
L Device:LED_ALT LED84
U 1 1 5DAA6661
P 7100 5850
F 0 "LED84" H 7500 5850 50  0000 C CNN
F 1 "LED_ALT" H 7093 5686 50  0001 C CNN
F 2 "lpa96_footprints:VLDx1232G" H 7100 5850 50  0001 C CNN
F 3 "~" H 7100 5850 50  0001 C CNN
	1    7100 5850
	-1   0    0    1   
$EndComp
$Comp
L Device:LED_ALT LED85
U 1 1 5DAA666B
P 7100 5950
F 0 "LED85" H 7500 5950 50  0000 C CNN
F 1 "LED_ALT" H 7093 5786 50  0001 C CNN
F 2 "lpa96_footprints:VLDx1232G" H 7100 5950 50  0001 C CNN
F 3 "~" H 7100 5950 50  0001 C CNN
	1    7100 5950
	-1   0    0    1   
$EndComp
$Comp
L Device:LED_ALT LED86
U 1 1 5DAA6675
P 7100 6050
F 0 "LED86" H 7500 6050 50  0000 C CNN
F 1 "LED_ALT" H 7093 5886 50  0001 C CNN
F 2 "lpa96_footprints:VLDx1232G" H 7100 6050 50  0001 C CNN
F 3 "~" H 7100 6050 50  0001 C CNN
	1    7100 6050
	-1   0    0    1   
$EndComp
$Comp
L Device:LED_ALT LED87
U 1 1 5DAA667F
P 7100 6150
F 0 "LED87" H 7500 6150 50  0000 C CNN
F 1 "LED_ALT" H 7093 5986 50  0001 C CNN
F 2 "lpa96_footprints:VLDx1232G" H 7100 6150 50  0001 C CNN
F 3 "~" H 7100 6150 50  0001 C CNN
	1    7100 6150
	-1   0    0    1   
$EndComp
$Comp
L Device:LED_ALT LED88
U 1 1 5DAA6689
P 7100 6250
F 0 "LED88" H 7500 6250 50  0000 C CNN
F 1 "LED_ALT" H 7093 6086 50  0001 C CNN
F 2 "lpa96_footprints:VLDx1232G" H 7100 6250 50  0001 C CNN
F 3 "~" H 7100 6250 50  0001 C CNN
	1    7100 6250
	-1   0    0    1   
$EndComp
Wire Wire Line
	7250 5850 7800 5850
Wire Wire Line
	7250 5950 7800 5950
Wire Wire Line
	7250 6050 7800 6050
Wire Wire Line
	7250 6150 7800 6150
Wire Wire Line
	7250 6250 7800 6250
Wire Wire Line
	6850 5450 6800 5450
Wire Wire Line
	7250 5550 7800 5550
$Comp
L Device:LED_ALT LED81
U 1 1 5DAA669A
P 7100 5550
F 0 "LED81" H 7500 5550 50  0000 C CNN
F 1 "LED_ALT" H 7093 5386 50  0001 C CNN
F 2 "lpa96_footprints:VLDx1232G" H 7100 5550 50  0001 C CNN
F 3 "~" H 7100 5550 50  0001 C CNN
	1    7100 5550
	-1   0    0    1   
$EndComp
Text HLabel 7650 5050 0    60   Input ~ 0
BLANK
Text HLabel 7650 5450 0    60   Input ~ 0
MODE
Text HLabel 7650 5250 0    60   Input ~ 0
SCLK
Text HLabel 7650 5150 0    60   Input ~ 0
XLAT
Wire Wire Line
	7800 5150 7650 5150
Wire Wire Line
	7800 5250 7650 5250
Wire Wire Line
	7800 5450 7650 5450
Wire Wire Line
	7650 5050 7800 5050
Wire Wire Line
	7200 5350 7800 5350
Wire Wire Line
	10000 5650 9900 5650
Wire Wire Line
	10000 5750 9900 5750
Wire Wire Line
	10000 5850 9900 5850
Wire Wire Line
	10000 5950 9900 5950
Wire Wire Line
	10000 6050 9900 6050
Wire Wire Line
	10000 6150 9900 6150
Wire Wire Line
	10000 6250 9900 6250
Wire Wire Line
	9900 5550 10000 5550
Wire Wire Line
	9300 5550 9600 5550
Wire Wire Line
	9600 5650 9300 5650
Wire Wire Line
	9300 5750 9600 5750
Wire Wire Line
	9600 5850 9300 5850
Wire Wire Line
	9300 5950 9600 5950
Wire Wire Line
	9600 6050 9300 6050
Wire Wire Line
	9300 6150 9600 6150
Wire Wire Line
	9300 6250 9600 6250
Connection ~ 10000 6150
Connection ~ 10000 6050
Connection ~ 10000 5950
Connection ~ 10000 5850
Connection ~ 10000 5750
Connection ~ 10000 5650
Connection ~ 10000 5550
Wire Wire Line
	10000 5450 10000 5550
Text HLabel 10050 5450 2    60   Input ~ 0
VIN
Wire Wire Line
	10000 6150 10000 6250
Wire Wire Line
	10000 6050 10000 6150
Wire Wire Line
	10000 5950 10000 6050
Wire Wire Line
	10000 5850 10000 5950
Wire Wire Line
	10000 5750 10000 5850
Wire Wire Line
	10000 5650 10000 5750
Wire Wire Line
	10000 5550 10000 5650
$Comp
L Device:LED_ALT LED96
U 1 1 5DAD7FDD
P 9750 5550
F 0 "LED96" H 10150 5550 50  0000 C CNN
F 1 "LED_ALT" H 9743 5386 50  0001 C CNN
F 2 "lpa96_footprints:VLDx1232G" H 9750 5550 50  0001 C CNN
F 3 "~" H 9750 5550 50  0001 C CNN
	1    9750 5550
	1    0    0    1   
$EndComp
$Comp
L Device:LED_ALT LED95
U 1 1 5DAD7FE7
P 9750 5650
F 0 "LED95" H 10150 5650 50  0000 C CNN
F 1 "LED_ALT" H 9743 5486 50  0001 C CNN
F 2 "lpa96_footprints:VLDx1232G" H 9750 5650 50  0001 C CNN
F 3 "~" H 9750 5650 50  0001 C CNN
	1    9750 5650
	1    0    0    1   
$EndComp
$Comp
L Device:LED_ALT LED94
U 1 1 5DAD7FF1
P 9750 5750
F 0 "LED94" H 10150 5750 50  0000 C CNN
F 1 "LED_ALT" H 9743 5586 50  0001 C CNN
F 2 "lpa96_footprints:VLDx1232G" H 9750 5750 50  0001 C CNN
F 3 "~" H 9750 5750 50  0001 C CNN
	1    9750 5750
	1    0    0    1   
$EndComp
$Comp
L Device:LED_ALT LED93
U 1 1 5DAD7FFB
P 9750 5850
F 0 "LED93" H 10150 5850 50  0000 C CNN
F 1 "LED_ALT" H 9743 5686 50  0001 C CNN
F 2 "lpa96_footprints:VLDx1232G" H 9750 5850 50  0001 C CNN
F 3 "~" H 9750 5850 50  0001 C CNN
	1    9750 5850
	1    0    0    1   
$EndComp
$Comp
L Device:LED_ALT LED92
U 1 1 5DAD8005
P 9750 5950
F 0 "LED92" H 10150 5950 50  0000 C CNN
F 1 "LED_ALT" H 9743 5786 50  0001 C CNN
F 2 "lpa96_footprints:VLDx1232G" H 9750 5950 50  0001 C CNN
F 3 "~" H 9750 5950 50  0001 C CNN
	1    9750 5950
	1    0    0    1   
$EndComp
$Comp
L Device:LED_ALT LED91
U 1 1 5DAD800F
P 9750 6050
F 0 "LED91" H 10150 6050 50  0000 C CNN
F 1 "LED_ALT" H 9743 5886 50  0001 C CNN
F 2 "lpa96_footprints:VLDx1232G" H 9750 6050 50  0001 C CNN
F 3 "~" H 9750 6050 50  0001 C CNN
	1    9750 6050
	1    0    0    1   
$EndComp
$Comp
L Device:LED_ALT LED90
U 1 1 5DAD8019
P 9750 6150
F 0 "LED90" H 10150 6150 50  0000 C CNN
F 1 "LED_ALT" H 9743 5986 50  0001 C CNN
F 2 "lpa96_footprints:VLDx1232G" H 9750 6150 50  0001 C CNN
F 3 "~" H 9750 6150 50  0001 C CNN
	1    9750 6150
	1    0    0    1   
$EndComp
$Comp
L Device:LED_ALT LED89
U 1 1 5DAD8023
P 9750 6250
F 0 "LED89" H 10150 6250 50  0000 C CNN
F 1 "LED_ALT" H 9743 6086 50  0001 C CNN
F 2 "lpa96_footprints:VLDx1232G" H 9750 6250 50  0001 C CNN
F 3 "~" H 9750 6250 50  0001 C CNN
	1    9750 6250
	1    0    0    1   
$EndComp
Wire Wire Line
	10000 5450 10050 5450
Wire Wire Line
	5800 1350 5800 6000
Wire Wire Line
	5800 1350 7800 1350
Wire Wire Line
	10750 2400 9250 2400
Wire Wire Line
	9250 2400 9250 2600
Wire Wire Line
	7200 2600 7200 3350
Wire Wire Line
	7200 2600 9250 2600
Wire Wire Line
	10750 2400 10750 1350
Wire Wire Line
	10750 3350 10750 4400
Wire Wire Line
	10750 4400 9250 4400
Wire Wire Line
	9250 4400 9250 4700
Wire Wire Line
	9250 4700 7200 4700
Wire Wire Line
	7200 4700 7200 5350
$Comp
L Device:LED_ALT LED33
U 1 1 5DE228C8
P 1550 6200
F 0 "LED33" H 1950 6200 50  0000 C CNN
F 1 "LED_ALT" H 1543 6036 50  0001 C CNN
F 2 "lpa96_footprints:VLDx1232G" H 1550 6200 50  0001 C CNN
F 3 "~" H 1550 6200 50  0001 C CNN
	1    1550 6200
	-1   0    0    1   
$EndComp
$Comp
L Device:LED_ALT LED34
U 1 1 5DC42C73
P 1550 6300
F 0 "LED34" H 1950 6300 50  0000 C CNN
F 1 "LED_ALT" H 1543 6136 50  0001 C CNN
F 2 "lpa96_footprints:VLDx1232G" H 1550 6300 50  0001 C CNN
F 3 "~" H 1550 6300 50  0001 C CNN
	1    1550 6300
	-1   0    0    1   
$EndComp
Text Label 4750 1400 0    50   ~ 0
SOUT1
Text Label 4750 3650 0    50   ~ 0
SOUT2
Text Label 4850 6000 0    50   ~ 0
SOUT3
Text Label 10350 1350 0    50   ~ 0
SOUT4
Text Label 10350 3350 0    50   ~ 0
SOUT5
Text Label 9350 5350 0    50   ~ 0
SOUT6
Wire Wire Line
	9300 5350 9700 5350
$Comp
L power:GND #PWR0101
U 1 1 5D60C7F0
P 2150 2450
F 0 "#PWR0101" H 2150 2200 50  0001 C CNN
F 1 "GND" H 2072 2333 50  0000 R BNN
F 2 "" H 2150 2450 50  0001 C CNN
F 3 "" H 2150 2450 50  0001 C CNN
	1    2150 2450
	1    0    0    -1  
$EndComp
Wire Wire Line
	2250 2400 2150 2400
Wire Wire Line
	2150 2450 2150 2400
$Comp
L power:GND #PWR0103
U 1 1 5D7A2AEB
P 2150 4700
F 0 "#PWR0103" H 2150 4450 50  0001 C CNN
F 1 "GND" H 2072 4583 50  0000 R BNN
F 2 "" H 2150 4700 50  0001 C CNN
F 3 "" H 2150 4700 50  0001 C CNN
	1    2150 4700
	1    0    0    -1  
$EndComp
Wire Wire Line
	2250 4650 2150 4650
Wire Wire Line
	2150 4700 2150 4650
$Comp
L power:GND #PWR0104
U 1 1 5D7D8305
P 2150 7050
F 0 "#PWR0104" H 2150 6800 50  0001 C CNN
F 1 "GND" H 2072 6933 50  0000 R BNN
F 2 "" H 2150 7050 50  0001 C CNN
F 3 "" H 2150 7050 50  0001 C CNN
	1    2150 7050
	1    0    0    -1  
$EndComp
$Comp
L power:GND #PWR0105
U 1 1 5D80D19F
P 7700 2400
F 0 "#PWR0105" H 7700 2150 50  0001 C CNN
F 1 "GND" H 7622 2283 50  0000 R BNN
F 2 "" H 7700 2400 50  0001 C CNN
F 3 "" H 7700 2400 50  0001 C CNN
	1    7700 2400
	1    0    0    -1  
$EndComp
$Comp
L power:GND #PWR0106
U 1 1 5D842CB1
P 7700 4400
F 0 "#PWR0106" H 7700 4150 50  0001 C CNN
F 1 "GND" H 7622 4283 50  0000 R BNN
F 2 "" H 7700 4400 50  0001 C CNN
F 3 "" H 7700 4400 50  0001 C CNN
	1    7700 4400
	1    0    0    -1  
$EndComp
Wire Wire Line
	7800 4350 7700 4350
Wire Wire Line
	7700 4400 7700 4350
$Comp
L power:GND #PWR0107
U 1 1 5D878F26
P 7700 6400
F 0 "#PWR0107" H 7700 6150 50  0001 C CNN
F 1 "GND" H 7622 6283 50  0000 R BNN
F 2 "" H 7700 6400 50  0001 C CNN
F 3 "" H 7700 6400 50  0001 C CNN
	1    7700 6400
	1    0    0    -1  
$EndComp
Wire Wire Line
	7800 6350 7700 6350
Wire Wire Line
	7700 6400 7700 6350
Wire Wire Line
	1650 2650 5200 2650
$Comp
L Device:C C?
U 1 1 5D98BF30
P 5750 6850
AR Path="/5D98BF30" Ref="C?"  Part="1" 
AR Path="/5362FF20/5D98BF30" Ref="C12"  Part="1" 
F 0 "C12" H 5750 6950 40  0000 L CNN
F 1 "10uF" H 5756 6765 40  0000 L CNN
F 2 "Capacitors_SMD:C_1206" H 5788 6700 30  0001 C CNN
F 3 "~" H 5750 6850 60  0000 C CNN
	1    5750 6850
	1    0    0    -1  
$EndComp
$Comp
L power:GND #PWR019
U 1 1 5D9C0F54
P 5750 7100
F 0 "#PWR019" H 5750 6850 50  0001 C CNN
F 1 "GND" H 5672 6983 50  0000 R BNN
F 2 "" H 5750 7100 50  0001 C CNN
F 3 "" H 5750 7100 50  0001 C CNN
	1    5750 7100
	1    0    0    -1  
$EndComp
$Comp
L power:GND #PWR0114
U 1 1 5D810AF3
P 10150 700
F 0 "#PWR0114" H 10150 450 50  0001 C CNN
F 1 "GND" H 10072 583 50  0000 R BNN
F 2 "" H 10150 700 50  0001 C CNN
F 3 "" H 10150 700 50  0001 C CNN
	1    10150 700 
	-1   0    0    -1  
$EndComp
$Comp
L power:GND #PWR0115
U 1 1 5D845B55
P 4600 750
F 0 "#PWR0115" H 4600 500 50  0001 C CNN
F 1 "GND" H 4522 633 50  0000 R BNN
F 2 "" H 4600 750 50  0001 C CNN
F 3 "" H 4600 750 50  0001 C CNN
	1    4600 750 
	-1   0    0    -1  
$EndComp
$Comp
L power:GND #PWR0116
U 1 1 5D87AC1A
P 4600 3000
F 0 "#PWR0116" H 4600 2750 50  0001 C CNN
F 1 "GND" H 4522 2883 50  0000 R BNN
F 2 "" H 4600 3000 50  0001 C CNN
F 3 "" H 4600 3000 50  0001 C CNN
	1    4600 3000
	-1   0    0    -1  
$EndComp
$Comp
L power:GND #PWR0117
U 1 1 5D8AFB35
P 4600 5350
F 0 "#PWR0117" H 4600 5100 50  0001 C CNN
F 1 "GND" H 4522 5233 50  0000 R BNN
F 2 "" H 4600 5350 50  0001 C CNN
F 3 "" H 4600 5350 50  0001 C CNN
	1    4600 5350
	-1   0    0    -1  
$EndComp
$Comp
L power:GND #PWR0118
U 1 1 5D8E4B28
P 10150 4700
F 0 "#PWR0118" H 10150 4450 50  0001 C CNN
F 1 "GND" H 10072 4583 50  0000 R BNN
F 2 "" H 10150 4700 50  0001 C CNN
F 3 "" H 10150 4700 50  0001 C CNN
	1    10150 4700
	-1   0    0    -1  
$EndComp
$Comp
L power:GND #PWR0119
U 1 1 5D919A01
P 10150 2700
F 0 "#PWR0119" H 10150 2450 50  0001 C CNN
F 1 "GND" H 10072 2583 50  0000 R BNN
F 2 "" H 10150 2700 50  0001 C CNN
F 3 "" H 10150 2700 50  0001 C CNN
	1    10150 2700
	-1   0    0    -1  
$EndComp
Wire Wire Line
	4350 1100 4450 1100
Wire Wire Line
	3750 1100 4050 1100
Wire Wire Line
	4350 3350 4450 3350
Wire Wire Line
	3750 3350 4050 3350
Wire Wire Line
	4350 5700 4450 5700
Wire Wire Line
	3750 5700 4050 5700
Wire Wire Line
	9900 5050 10000 5050
Wire Wire Line
	9300 5050 9600 5050
Wire Wire Line
	9900 3050 10000 3050
Wire Wire Line
	9300 3050 9600 3050
Wire Wire Line
	9900 1050 10000 1050
Wire Wire Line
	9300 1050 9600 1050
Wire Wire Line
	5750 7000 5750 7050
Wire Wire Line
	4050 5200 4050 5250
Wire Wire Line
	4050 5550 4050 5600
Wire Wire Line
	4050 2850 4050 2900
Wire Wire Line
	4050 3200 4050 3250
Wire Wire Line
	4050 600  4050 650 
Wire Wire Line
	4050 950  4050 1000
Wire Wire Line
	9600 550  9600 600 
Wire Wire Line
	9600 900  9600 950 
Wire Wire Line
	9600 2550 9600 2600
Wire Wire Line
	9600 2900 9600 2950
Wire Wire Line
	9600 4550 9600 4600
Wire Wire Line
	9600 4900 9600 4950
$Comp
L power:GND #PWR08
U 1 1 5DE22866
P 2050 5600
F 0 "#PWR08" H 2050 5600 30  0001 C CNN
F 1 "GND" H 2050 5530 30  0001 C CNN
F 2 "" H 2050 5600 60  0000 C CNN
F 3 "" H 2050 5600 60  0000 C CNN
	1    2050 5600
	0    1    1    0   
$EndComp
Wire Wire Line
	2250 5600 2050 5600
Wire Wire Line
	2150 7050 2150 7000
Wire Wire Line
	2150 7000 2250 7000
Wire Wire Line
	7700 2400 7700 2350
Wire Wire Line
	7700 2350 7800 2350
Text HLabel 5500 7050 0    50   Input ~ 0
GND
Wire Wire Line
	5500 7050 5750 7050
Connection ~ 5750 7050
Wire Wire Line
	5750 7050 5750 7100
$Comp
L lpa96_symbols:TLC5941 U7
U 1 1 53630EB0
P 8550 3600
F 0 "U7" H 8550 3500 50  0000 C CNN
F 1 "TLC5941" H 8550 3700 50  0000 C CNN
F 2 "lpa96_footprints:TLC5941_PWP_28" H 8550 3600 50  0001 C CNN
F 3 "DOCUMENTATION" H 8550 3600 50  0001 C CNN
	1    8550 3600
	1    0    0    -1  
$EndComp
$Comp
L power:VCC #PWR?
U 1 1 5D9AE7D6
P 9400 4800
AR Path="/5D9AE7D6" Ref="#PWR?"  Part="1" 
AR Path="/5362FF20/5D9AE7D6" Ref="#PWR0126"  Part="1" 
F 0 "#PWR0126" H 9400 4650 50  0001 C CNN
F 1 "VCC" H 9417 4973 50  0000 C CNN
F 2 "" H 9400 4800 50  0001 C CNN
F 3 "" H 9400 4800 50  0001 C CNN
	1    9400 4800
	1    0    0    -1  
$EndComp
Wire Wire Line
	9400 4800 9400 4950
$Comp
L Device:C C11
U 1 1 53630EAA
P 9600 4750
F 0 "C11" H 9600 4850 40  0000 L CNN
F 1 "100nF" H 9400 4650 40  0000 L CNN
F 2 "Capacitors_SMD:C_0805" H 9638 4600 30  0001 C CNN
F 3 "~" H 9600 4750 60  0000 C CNN
	1    9600 4750
	-1   0    0    1   
$EndComp
$Comp
L Device:C C10
U 1 1 53630EC9
P 9600 2750
F 0 "C10" H 9600 2850 40  0000 L CNN
F 1 "100nF" H 9400 2650 40  0000 L CNN
F 2 "Capacitors_SMD:C_0805" H 9638 2600 30  0001 C CNN
F 3 "~" H 9600 2750 60  0000 C CNN
	1    9600 2750
	-1   0    0    1   
$EndComp
$Comp
L power:VCC #PWR?
U 1 1 5D9E9520
P 9400 2800
AR Path="/5D9E9520" Ref="#PWR?"  Part="1" 
AR Path="/5362FF20/5D9E9520" Ref="#PWR0127"  Part="1" 
F 0 "#PWR0127" H 9400 2650 50  0001 C CNN
F 1 "VCC" H 9417 2973 50  0000 C CNN
F 2 "" H 9400 2800 50  0001 C CNN
F 3 "" H 9400 2800 50  0001 C CNN
	1    9400 2800
	1    0    0    -1  
$EndComp
Wire Wire Line
	9400 2800 9400 2950
$Comp
L Device:C C9
U 1 1 53630EE2
P 9600 750
F 0 "C9" H 9600 850 40  0000 L CNN
F 1 "100nF" H 9400 650 40  0000 L CNN
F 2 "Capacitors_SMD:C_0805" H 9638 600 30  0001 C CNN
F 3 "~" H 9600 750 60  0000 C CNN
	1    9600 750 
	-1   0    0    1   
$EndComp
$Comp
L power:VCC #PWR?
U 1 1 5DA231D4
P 9400 800
AR Path="/5DA231D4" Ref="#PWR?"  Part="1" 
AR Path="/5362FF20/5DA231D4" Ref="#PWR0128"  Part="1" 
F 0 "#PWR0128" H 9400 650 50  0001 C CNN
F 1 "VCC" H 9417 973 50  0000 C CNN
F 2 "" H 9400 800 50  0001 C CNN
F 3 "" H 9400 800 50  0001 C CNN
	1    9400 800 
	1    0    0    -1  
$EndComp
Wire Wire Line
	9400 800  9400 950 
$Comp
L power:VCC #PWR?
U 1 1 5DA5D878
P 5750 6500
AR Path="/5DA5D878" Ref="#PWR?"  Part="1" 
AR Path="/5362FF20/5DA5D878" Ref="#PWR0129"  Part="1" 
F 0 "#PWR0129" H 5750 6350 50  0001 C CNN
F 1 "VCC" H 5767 6673 50  0000 C CNN
F 2 "" H 5750 6500 50  0001 C CNN
F 3 "" H 5750 6500 50  0001 C CNN
	1    5750 6500
	1    0    0    -1  
$EndComp
$Comp
L Device:C C8
U 1 1 53630180
P 4050 5400
F 0 "C8" H 4050 5500 40  0000 L CNN
F 1 "100nF" H 3850 5300 40  0000 L CNN
F 2 "Capacitors_SMD:C_0805" H 4088 5250 30  0001 C CNN
F 3 "~" H 4050 5400 60  0000 C CNN
	1    4050 5400
	-1   0    0    1   
$EndComp
$Comp
L power:VCC #PWR?
U 1 1 5DB0D020
P 3850 5450
AR Path="/5DB0D020" Ref="#PWR?"  Part="1" 
AR Path="/5362FF20/5DB0D020" Ref="#PWR0130"  Part="1" 
F 0 "#PWR0130" H 3850 5300 50  0001 C CNN
F 1 "VCC" H 3867 5623 50  0000 C CNN
F 2 "" H 3850 5450 50  0001 C CNN
F 3 "" H 3850 5450 50  0001 C CNN
	1    3850 5450
	1    0    0    -1  
$EndComp
Wire Wire Line
	3850 5450 3850 5600
$Comp
L Device:C C7
U 1 1 53AA0807
P 4050 3050
F 0 "C7" H 4050 3150 40  0000 L CNN
F 1 "100nF" H 3850 2950 40  0000 L CNN
F 2 "Capacitors_SMD:C_0805" H 4088 2900 30  0001 C CNN
F 3 "~" H 4050 3050 60  0000 C CNN
	1    4050 3050
	-1   0    0    1   
$EndComp
$Comp
L power:VCC #PWR?
U 1 1 5DB46801
P 3850 3100
AR Path="/5DB46801" Ref="#PWR?"  Part="1" 
AR Path="/5362FF20/5DB46801" Ref="#PWR0131"  Part="1" 
F 0 "#PWR0131" H 3850 2950 50  0001 C CNN
F 1 "VCC" H 3867 3273 50  0000 C CNN
F 2 "" H 3850 3100 50  0001 C CNN
F 3 "" H 3850 3100 50  0001 C CNN
	1    3850 3100
	1    0    0    -1  
$EndComp
Wire Wire Line
	3850 3100 3850 3250
$Comp
L Device:C C6
U 1 1 53630972
P 4050 800
F 0 "C6" H 4050 900 40  0000 L CNN
F 1 "100nF" H 3850 700 40  0000 L CNN
F 2 "Capacitors_SMD:C_0805" H 4088 650 30  0001 C CNN
F 3 "~" H 4050 800 60  0000 C CNN
	1    4050 800 
	-1   0    0    1   
$EndComp
$Comp
L power:VCC #PWR?
U 1 1 5DB7FF8C
P 3850 800
AR Path="/5DB7FF8C" Ref="#PWR?"  Part="1" 
AR Path="/5362FF20/5DB7FF8C" Ref="#PWR0132"  Part="1" 
F 0 "#PWR0132" H 3850 650 50  0001 C CNN
F 1 "VCC" H 3867 973 50  0000 C CNN
F 2 "" H 3850 800 50  0001 C CNN
F 3 "" H 3850 800 50  0001 C CNN
	1    3850 800 
	1    0    0    -1  
$EndComp
Text HLabel 5500 6600 0    50   Input ~ 0
VCC
Wire Wire Line
	5500 6600 5750 6600
Connection ~ 5750 6600
Wire Wire Line
	5750 6600 5750 6700
Wire Wire Line
	3850 800  3850 1000
Wire Wire Line
	5750 6500 5750 6600
$EndSCHEMATC
