@startuml

start
:I2C Communication between OBC and SPINO
<#red>|= action |= name  |= size |
<#blue>|Transmit | I2CSatusTransmitBuffer| 1 octet |
<#blue>|Transmit | I2CTransmitBuffer | n(64) octet |
<#yellow>|Receive | I2CSatusReceivedBuffer| 1 octet |
<#yellow>|Receive | I2CReceivedBuffer | n(64) octet |>


@enduml