v 20110115 2
P 0 300 200 300 1 0 0
{
T 100 350 5 8 0 1 0 6 1
pinnumber=1
T 100 250 5 8 0 1 0 8 1
pinseq=1
T 250 300 9 8 0 1 0 0 1
pinlabel=+
T 250 300 5 8 0 1 0 2 1
pintype=pwr
}
P 1100 300 900 300 1 0 0
{
T 800 350 5 8 0 1 0 6 1
pinnumber=2
T 800 250 5 8 0 1 0 8 1
pinseq=2
T 950 300 9 8 0 1 0 0 1
pinlabel=-
T 950 300 5 8 0 1 0 2 1
pintype=pwr
}
T 700 0 8 10 1 1 0 6 1
refdes=R?
T 400 500 8 10 1 1 0 0 1
value=100
B 200 200 700 200 3 0 0 0 -1 -1 0 -1 -1 -1 -1 -1
