v 20110115 2
C 40000 40000 0 0 0 title-B.sym
C 48000 47900 1 0 0 mp_One_jn.sym
C 50200 47900 1 0 0 mp_One_jn.sym
C 49100 47900 1 0 0 mp_Zero_jn.sym
C 51300 47900 1 0 0 mp_Zero_jn.sym
C 51800 47900 1 270 0 1p_Cbond.sym
{
T 51800 46800 5 10 1 1 270 6 1
refdes=C
T 52000 47100 5 10 1 1 270 0 1
value=100uF
}
C 50800 49000 1 90 0 1p_Lbond.sym
{
T 50800 50100 5 10 1 1 90 6 1
refdes=L
T 50600 49800 5 10 1 1 90 0 1
value=10mH
}
C 49700 47900 1 90 1 1p_diode.sym
{
T 49700 46800 5 10 1 1 270 8 1
refdes=D
T 49705 47905 5 10 0 1 270 2 1
value=Def
}
C 52400 48400 1 0 0 1p_Rbond.sym
{
T 53500 48400 5 10 1 1 0 6 1
refdes=RL
T 53200 48600 5 10 1 1 0 0 1
value=100
}
C 48600 49000 1 90 0 1p_power_switch.sym
{
T 48600 50300 5 10 1 1 90 6 1
refdes=xSW
T 48105 48995 5 10 0 1 90 0 1
value=0 power_sw
}
C 46400 48200 1 0 0 1p_Se_bond.sym
{
T 47100 48400 5 10 1 1 0 6 1
refdes=Vin
T 46790 48195 5 10 1 1 0 0 1
value=12V
}
C 40300 44900 1 0 0 1p_Se_bond.sym
{
T 41000 45100 5 10 1 1 0 6 1
refdes=Vref
T 40590 44895 5 10 1 1 0 0 1
value=5V
}
C 40300 50100 1 0 0 include_file.sym
{
T 40300 50700 5 10 1 1 0 0 1
refdes=.INCLUDE
T 40800 50100 5 10 1 1 0 0 1
value=/home/lums/bin/edt01.sub
}
C 46100 44700 1 0 0 pwm_single.sym
{
T 47100 44700 5 10 1 1 0 6 1
refdes=xPWM1
T 46195 45600 5 10 1 1 0 0 1
value=PWMtri fs = 10kHz
}
N 48500 47900 48600 47900 4
N 50700 47900 50800 47900 4
C 47900 48100 1 0 0 gnd-1.sym
C 49400 49000 1 0 0 generic-power.sym
{
T 49600 49250 5 10 1 1 0 3 1
net=nVd:1
}
C 51600 49000 1 0 0 generic-power.sym
{
T 51800 49250 5 10 1 1 0 3 1
net=nVc:1
}
C 41800 44800 1 0 0 gnd-1.sym
N 47500 45200 48600 45200 4
N 48200 45200 48200 49400 4
C 48400 45400 1 0 0 generic-power.sym
{
T 48600 45650 5 10 1 1 0 3 1
net=nVg:1
}
N 48600 45400 48600 45200 4
N 43200 45200 43600 45200 4
N 45000 45200 46100 45200 4
N 41900 45200 42000 45200 4
N 42600 44600 42600 43500 4
N 42600 43500 44500 43500 4
C 42000 44600 1 0 0 sum.sym
{
T 43300 44700 5 10 1 1 0 6 1
refdes=xSUM
T 42395 45100 5 10 0 1 0 0 1
value=sum
}
C 43000 44700 1 0 0 pid_with_antiwindup.sym
{
T 44500 44700 5 10 1 1 0 6 1
refdes=xPID
T 42695 45900 5 10 1 1 0 0 1
value=PID Ki=1 Kp=1 Kd=0 lsat=-0.9 usat=0.9
}
C 44300 43500 1 0 0 generic-power.sym
{
T 44500 43750 5 10 1 1 0 3 1
net=nVc:1
}
