v 20110115 2
C 40000 40000 0 0 0 title-B.sym
C 47300 46700 1 90 0 1p_Lbond.sym
{
T 47300 47800 5 10 1 1 90 6 1
refdes=L1
T 47100 47500 5 10 1 1 90 0 1
value=1mH
}
C 50000 48300 1 0 0 1p_Rbond.sym
{
T 51100 48300 5 10 1 1 0 6 1
refdes=R3
T 50800 48500 5 10 1 1 0 0 1
value=100
}
C 50000 43900 1 0 0 1p_Rbond.sym
{
T 51100 43900 5 10 1 1 0 6 1
refdes=R4
T 50800 44100 5 10 1 1 0 0 1
value=10
}
C 48100 50500 1 90 1 1p_Se_bond.sym
{
T 47900 49800 5 10 1 1 270 8 1
refdes=VSe1
T 48105 50510 5 10 1 1 270 2 1
value=SIN(0 325 50 0 0 0)
}
C 47300 47800 1 0 0 mp_Zero_jn.sym
C 46700 45600 1 0 0 mp_One_jn.sym
C 46700 48300 1 0 0 1p_Link_bond_3.sym
C 46100 47800 1 270 0 1p_Link_bond.sym
C 47800 45600 1 0 0 mp_One_jn.sym
C 48400 46700 1 90 0 1p_Cbond.sym
{
T 48400 47800 5 10 1 1 90 6 1
refdes=C1
T 48200 47500 5 10 1 1 90 0 1
value=10uF
}
C 46700 47800 1 90 0 mp_One_jn.sym
C 48400 48300 1 0 0 1p_Link_bond_3.sym
C 49400 47800 1 270 0 1p_Link_bond.sym
C 46700 43900 1 0 0 1p_Link_bond_3.sym
C 48400 43900 1 0 0 1p_Link_bond_3.sym
C 46100 45600 1 270 0 1p_Link_bond.sym
C 49400 45600 1 270 0 1p_Link_bond.sym
C 48900 47800 1 270 1 mp_One_jn.sym
C 48100 41800 1 90 0 1p_Se_bond.sym
{
T 47900 42500 5 10 1 1 90 6 1
refdes=Vgnd
T 48205 42090 5 10 1 1 90 0 1
value=0
}
N 46100 48900 46200 48900 4
N 49400 48900 49500 48900 4
N 47200 45600 47300 45600 4
N 48300 45600 48400 45600 4
N 46100 43400 46200 43400 4
N 49400 43400 49500 43400 4
C 40300 50000 1 0 0 include_file.sym
{
T 40300 50600 5 10 1 1 0 0 1
refdes=.INCLUDE
T 40800 50000 5 10 1 1 0 0 1
value=/home/lums/bin/edt01.sub
}
C 47100 48400 1 0 0 generic-power.sym
{
T 47300 48650 5 10 1 1 0 3 1
net=nVcc:1
}
C 47600 46200 1 0 0 generic-power.sym
{
T 47800 46450 5 10 1 1 0 3 1
net=nVc:1
}
C 47300 44500 1 180 1 mp_Zero_jn.sym
C 46700 44500 1 90 1 mp_One_jn.sym
C 48900 44500 1 270 0 mp_One_jn.sym
C 46700 45600 1 90 0 mp_Zero_jn.sym
C 48900 45600 1 270 1 mp_Zero_jn.sym
C 48200 43100 1 0 0 gnd-1.sym
N 48300 43400 47900 43400 4
C 47500 43900 1 180 0 generic-power.sym
{
T 47300 43650 5 10 1 1 180 3 1
net=nVgnd:1
}
C 46100 45400 1 90 0 generic-power.sym
{
T 45850 45600 5 10 1 1 90 3 1
net=nVa:1
}
C 49500 45800 1 270 0 generic-power.sym
{
T 49750 45600 5 10 1 1 270 3 1
net=nVb:1
}
C 45600 48300 1 0 1 1p_Rbond.sym
{
T 44500 48300 5 10 1 1 180 8 1
refdes=R1
T 44800 48500 5 10 1 1 180 2 1
value=10
}
C 45600 43900 1 0 1 1p_Rbond.sym
{
T 44500 43900 5 10 1 1 180 8 1
refdes=R2
T 44800 44100 5 10 1 1 180 2 1
value=100
}
