v 20110115 2
P 0 1000 300 1000 1 0 0
{
T 200 1050 5 8 0 1 0 6 1
pinnumber=1
T 200 950 5 8 0 1 0 8 1
pinseq=1
T 350 1000 9 8 0 1 0 0 1
pinlabel=p+
T 350 1000 5 8 0 1 0 2 1
pintype=pwr
}
P 0 0 300 0 1 0 0
{
T 200 50 5 8 0 1 0 6 1
pinnumber=2
T 200 -50 5 8 0 1 0 8 1
pinseq=2
T 350 0 9 8 0 1 0 0 1
pinlabel=p-
T 350 0 5 8 0 1 0 2 1
pintype=pwr
}
T -55 1262 8 10 0 1 0 0 1
value=xfmer Np=1 Ns=1 C=100uF
T 195 1050 8 10 1 1 0 0 1
refdes=xfm?
T 150 850 9 10 1 0 0 0 1
o
T 600 850 9 10 1 0 0 0 1
o
A 300 950 50 270 180 3 0 0 0 -1 -1
A 300 850 50 270 180 3 0 0 0 -1 -1
A 300 750 50 270 180 3 0 0 0 -1 -1
A 300 650 50 270 180 3 0 0 0 -1 -1
A 300 550 50 270 180 3 0 0 0 -1 -1
A 550 950 50 90 180 3 0 0 0 -1 -1
A 550 850 50 90 180 3 0 0 0 -1 -1
A 550 750 50 90 180 3 0 0 0 -1 -1
A 550 650 50 90 180 3 0 0 0 -1 -1
A 550 550 50 90 180 3 0 0 0 -1 -1
L 400 1000 400 0 3 0 0 0 -1 -1
L 450 1000 450 0 3 0 0 0 -1 -1
P 850 0 550 0 1 0 0
{
T 650 50 5 8 0 1 0 0 1
pinnumber=4
T 650 -50 5 8 0 1 0 2 1
pinseq=4
T 500 0 9 8 0 1 0 6 1
pinlabel=s-
T 500 0 5 8 0 1 0 8 1
pintype=pwr
}
P 850 1000 550 1000 1 0 0
{
T 650 1050 5 8 0 1 0 0 1
pinnumber=3
T 650 950 5 8 0 1 0 2 1
pinseq=3
T 500 1000 9 8 0 1 0 6 1
pinlabel=s+
T 500 1000 5 8 0 1 0 8 1
pintype=pwr
}
A 300 450 50 270 180 3 0 0 0 -1 -1
A 300 350 50 270 180 3 0 0 0 -1 -1
A 300 250 50 270 180 3 0 0 0 -1 -1
A 300 150 50 270 180 3 0 0 0 -1 -1
A 300 50 50 270 180 3 0 0 0 -1 -1
A 550 450 50 90 180 3 0 0 0 -1 -1
A 550 350 50 90 180 3 0 0 0 -1 -1
A 550 250 50 90 180 3 0 0 0 -1 -1
A 550 150 50 90 180 3 0 0 0 -1 -1
A 550 50 50 90 180 3 0 0 0 -1 -1
