v 20110115 2
P 300 1000 300 800 1 0 0
{
T 400 850 5 8 0 1 0 0 1
pinnumber=1
T 400 750 5 8 0 1 0 2 1
pinseq=1
T 250 800 9 8 0 1 0 6 1
pinlabel=+
T 250 800 5 8 0 1 0 8 1
pintype=pwr
}
P 300 0 300 200 1 0 0
{
T 400 250 5 8 0 1 0 0 1
pinnumber=2
T 400 150 5 8 0 1 0 2 1
pinseq=2
T 250 200 9 8 0 1 0 6 1
pinlabel=-
T 250 200 5 8 0 1 0 8 1
pintype=pwr
}
T 500 400 8 10 1 1 0 6 1
refdes=ISf?
T 490 95 8 10 1 1 0 0 1
value=SIN(0 325 50 0 0 0)
V 300 500 300 3 0 0 0 -1 -1 0 -1 -1 -1 -1 -1
