v 20110619 2
C 40000 40000 0 0 0 title-B.sym
C 43900 44900 1 0 0 1p_Se_bond.sym
{
T 44600 45100 5 10 1 1 0 6 1
refdes=Vcontrol
T 44190 44895 5 10 1 1 0 0 1
value=0.5V
}
C 40300 50100 1 0 0 include_file.sym
{
T 40300 50700 5 10 1 1 0 0 1
refdes=.INCLUDE
T 40800 50100 5 10 1 1 0 0 1
value=../simsetup/bin/edt01.sub
}
C 46100 44700 1 0 0 pwm_single.sym
{
T 47100 44700 5 10 1 1 0 6 1
refdes=xPWM1
T 46195 45600 5 10 1 1 0 0 1
value=PWMtri fs = 10kHz
}
C 46700 47100 1 0 0 gnd-1.sym
C 49800 49800 1 0 0 generic-power.sym
{
T 50000 50050 5 10 1 1 0 3 1
net=nVd:1
}
C 53200 49800 1 0 0 generic-power.sym
{
T 53400 50050 5 10 1 1 0 3 1
net=nVc:1
}
C 45400 44800 1 0 0 gnd-1.sym
N 47500 45200 49100 45200 4
C 48900 45500 1 0 0 generic-power.sym
{
T 49100 45750 5 10 1 1 0 3 1
net=nVg:1
}
N 45500 45200 46100 45200 4
C 53100 48500 1 0 0 C1.sym
{
T 53900 48500 5 10 1 1 0 6 1
refdes=C
T 53600 49000 5 10 1 1 0 0 1
value=100uF
}
C 50200 49100 1 180 0 Def.sym
{
T 49700 49100 5 10 1 1 180 6 1
refdes=D
T 50505 49205 5 10 0 1 180 0 1
value=Def
}
C 46500 48200 1 0 0 Esource.sym
{
T 46900 48600 5 10 1 1 0 6 1
refdes=Vin
T 46990 48295 5 10 1 1 0 0 1
value=12V
}
C 50700 49600 1 0 0 L1.sym
{
T 51700 49600 5 10 1 1 0 6 1
refdes=L
T 51400 50100 5 10 1 1 0 0 1
value=10mH
}
C 55200 48300 1 90 0 R1.sym
{
T 55200 49000 5 10 1 1 90 6 1
refdes=RL
T 54700 48700 5 10 1 1 90 0 1
value=100
}
C 48800 48700 1 90 0 power_sw.sym
{
T 48800 49400 5 10 1 1 90 6 1
refdes=xSW
T 48905 47895 5 10 0 1 90 0 1
value=0 power_sw
}
N 46800 47400 46800 48200 4
N 46800 49200 46800 49800 4
N 46800 49800 47800 49800 4
N 48800 49800 50700 49800 4
N 52500 49800 54900 49800 4
N 54900 49800 54900 49400 4
N 54900 48300 54900 47700 4
N 54900 47700 46800 47700 4
N 50000 49100 50000 49800 4
N 50000 48400 50000 47700 4
N 53400 48500 53400 47700 4
N 53400 49100 53400 49800 4
N 49100 45200 49100 45500 4
N 48300 48700 48300 45200 4
