v 20110619 2
B 600 200 1100 800 3 0 0 0 -1 -1 0 -1 -1 -1 -1 -1
L 800 800 700 700 3 0 0 0 -1 -1
P 400 600 600 600 1 0 0
{
T 600 1000 5 10 0 0 180 0 1
pintype=pas
T 355 395 5 10 1 1 0 0 1
pinlabel=in
T 505 645 5 10 1 1 0 6 1
pinnumber=1
T 400 600 5 10 0 0 180 0 1
pinseq=1
}
P 1900 600 1700 600 1 0 0
{
T 1900 800 5 10 0 0 0 0 1
pintype=pas
T 1945 395 5 10 1 1 0 6 1
pinlabel=out
T 1795 645 5 10 1 1 0 0 1
pinnumber=2
T 1900 600 5 10 0 0 0 0 1
pinseq=2
}
T 0 1100 8 10 1 1 0 0 1
value=pwms fs=20000 dmin=0.1 dmax=0.9
T 800 1300 8 10 1 1 0 0 1
refdes=Xpwm?
P 1000 0 1000 200 1 0 0
{
T 2000 -200 5 10 0 0 180 0 1
pintype=pas
T 1345 200 5 10 1 1 180 0 1
pinlabel=gnd
T 905 150 5 10 1 1 180 0 1
pinnumber=3
T 1800 0 5 10 0 0 180 0 1
pinseq=3
}
L 800 700 800 800 3 0 0 0 -1 -1
L 800 700 900 800 3 0 0 0 -1 -1
L 900 800 900 700 3 0 0 0 -1 -1
L 700 500 1000 500 3 0 0 0 -1 -1
L 1300 800 1300 400 3 0 0 0 -1 -1
L 1300 400 1600 600 3 0 0 0 -1 -1
L 1300 800 1600 600 3 0 0 0 -1 -1
L 1000 800 1000 700 3 0 0 0 -1 -1
L 900 700 1000 800 3 0 0 0 -1 -1
L 1100 500 1300 500 3 0 0 0 -1 -1
L 1100 700 1300 700 3 0 0 0 -1 -1
L 1600 600 1700 600 3 0 0 0 -1 -1
