v 20091004 2
P 0 100 300 100 1 0 0
{
T 200 150 5 8 0 1 0 6 1
pinnumber=1
T 200 50 5 8 0 1 0 8 1
pinseq=1
T 350 100 9 8 0 1 0 0 1
pinlabel=+
T 350 100 5 8 0 1 0 2 1
pintype=pwr
}
P 0 0 300 0 1 0 0
{
T 200 50 5 8 0 1 0 6 1
pinnumber=2
T 200 -50 5 8 0 1 0 8 1
pinseq=2
T 350 0 9 8 0 1 0 0 1
pinlabel=-
T 350 0 5 8 0 1 0 2 1
pintype=pwr
}
T 1100 0 8 10 1 1 0 6 1
refdes=L?
L 300 100 600 100 3 0 0 0 -1 -1
L 600 100 600 200 3 0 0 0 -1 -1
L 600 200 800 0 3 0 0 0 -1 -1
L 800 0 300 0 3 0 0 0 -1 -1
T 800 200 8 10 1 1 0 0 1
value=1mH
