v 20110115 2
P 0 100 300 100 1 0 0
{
T 200 150 5 8 0 1 0 6 1
pinnumber=1
T 200 50 5 8 0 1 0 8 1
pinseq=1
T 350 100 9 8 0 1 0 0 1
pinlabel=+
T 350 100 5 8 0 1 0 2 1
pintype=pwr
}
P 0 0 300 0 1 0 0
{
T 200 50 5 8 0 1 0 6 1
pinnumber=2
T 200 -50 5 8 0 1 0 8 1
pinseq=2
T 350 0 9 8 0 1 0 0 1
pinlabel=-
T 350 0 5 8 0 1 0 2 1
pintype=pwr
}
T 1300 0 8 10 1 1 0 6 1
refdes=xSW?
L 300 100 600 100 3 0 0 0 -1 -1
L 600 100 600 200 3 0 0 0 -1 -1
L 600 200 800 0 3 0 0 0 -1 -1
L 800 0 300 0 3 0 0 0 -1 -1
P 400 400 400 200 1 0 0
{
T 400 500 5 10 0 1 0 0 1
pintype=pwr
T 400 245 5 10 0 1 90 6 1
pinlabel=nc+
T 350 395 5 10 0 1 90 0 1
pinnumber=3
T 400 500 5 10 0 1 0 0 1
pinseq=3
}
L 400 400 400 100 3 0 0 0 -1 -1
L 400 100 300 200 3 0 0 0 -1 -1
L 300 200 500 200 3 0 0 0 -1 -1
L 400 100 500 200 3 0 0 0 -1 -1
T -5 495 8 10 0 1 0 0 1
value=power_sw
