v 20110115 2
P 300 800 300 500 1 0 0
{
T 200 550 5 8 0 1 0 6 1
pinnumber=1
T 200 450 5 8 0 1 0 8 1
pinseq=1
T 350 500 9 8 0 1 0 0 1
pinlabel=+
T 350 500 5 8 0 1 0 2 1
pintype=pwr
}
P 300 0 300 300 1 0 0
{
T 200 350 5 8 0 1 0 6 1
pinnumber=2
T 200 250 5 8 0 1 0 8 1
pinseq=2
T 350 300 9 8 0 1 0 0 1
pinlabel=-
T 350 300 5 8 0 1 0 2 1
pintype=pwr
}
T 800 100 8 10 1 1 0 6 1
refdes=SW?
P 0 400 200 400 1 0 0
{
T 200 700 5 10 0 1 0 0 1
pintype=pwr
T 200 445 5 10 0 1 90 6 1
pinlabel=nc+
T 150 595 5 10 0 1 90 0 1
pinnumber=3
T 200 700 5 10 0 1 0 0 1
pinseq=3
}
T -205 -405 8 10 0 1 0 0 1
value=0 switch
L 500 500 300 300 3 0 0 0 -1 -1
L 300 400 200 500 3 0 0 0 -1 -1
L 200 500 200 300 3 0 0 0 -1 -1
L 200 300 300 400 3 0 0 0 -1 -1
L 300 400 200 400 3 0 0 0 -1 -1
