
[
    {
        "id":1,
        "name":"Гипсэн хавтан",
        "dimension":"9.5*1220*2440мм",
        "image":"",
        "pieces": "1000",
        "description":"",
        "unitOfMeasure":"мкв",
        "status":"энгийн"
    },
    {
        "id":2,
        "name":"Хөнгөн цагаан дүүжин тааз (цагаан)",
        "dimension":"0.4мм-н зузаантай, 300*300мм-н зузаантай",
        "image":"",
        "pieces":"500",
        "description":"",
        "unitOfMeasure":"м3",
        "status":"яаралтай"
    },
    {
        "id":3,
        "name":"Саарал сендвичэн хавтан ",
        "dimension":"15 см зузаантай",
        "image":"",
        "pieces":"2500",
        "description":"",
        "unitOfMeasure":"м",
        "status":"энгийн"
    }
]