[
    {
        "id":1,
        "name":"Барилга угсралтын ажил",
        "requirements":[
            "Сүүлийн 5 жилийн хугацаанд барилгын угсралтын ижил төстэй 3-аас доошгүй ажил гүйцэтгэсэн туршлагатай байх. Сүүлийн 2 жил тасралтгүй ажилласан байх. Ижил төстэй ажил гэдэгт олон нийт, иргэний барилга угсралтын ажлыг тооцно",
            "Санхүүгийн чадавхтай байх.",
            "Тухайн ажлыг гүйцэтгэх барилгын тусгай зөвшөөрөлтэй байх. Тухайн зөвшөөрлийн хугацаа ажил дуусах хүртэлх хугацаанд үргэлжлэхээр байх.",
            "Ажлыг захиалагчаас гаргасан зураг төслийн дагуу гүйцэтгэнэ"
        ],
        "license":[],
        "status":"энгийн",
        "duration": "12 сар"
    },
    {
        "id":2,
        "name":"Барилгын дотор талын буулгалт нураалтын ажил",
        "requirements":[
            "Сүүлийн 5 жилийн хугацаанд барилгын угсралтын ижил төстэй 3-аас доошгүй ажил гүйцэтгэсэн туршлагатай байх. Сүүлийн 2 жил тасралтгүй ажилласан байх.  Ижил төстэй ажил гэдэгт дараах ажлыг тооцно: Барилгын дотор таазны буулгалт, цахилгааны тоноглол, цахилгааны шит самбар, цахилгааны шугам хоолой, дотор агааржуулалтын систем, сантехникийн тоноглол, шугам хоолой, сантехникийн узель, гражын автомат хаалга, дотор шилэн хана, шатны бариул, 00 өрөөний тусгаарлах хана, вакум цонх, галын дохиоллын систем-ын буулгалтын ажил",
            "Санхүүгийн чадавхтай байх.",
            "Тухайн ажлыг гүйцэтгэх тусгай зөвшөөрөлтэй байх. Тухайн зөвшөөрлийн хугацаа ажил дуусах хүртэлх хугацаанд үргэлжлэхээр байх.",
            "Ажлыг захиалагчаас гаргасан зураг төслийн дагуу гүйцэтгэнэ"
        ],
        "license":[],
        "status":"энгийн",
        "duration": "24 сар"
    },
    {
        "id":3,
        "name":"Гадна шугам сүлжээний угсралтын ажил",
        "requirements":[
            "Сүүлийн 5 жилийн хугацаанд барилгын угсралтын ижил төстэй 3-аас доошгүй ажил гүйцэтгэсэн туршлагатай байх. Сүүлийн 2 жил тасралтгүй ажилласан байх.",
            "Санхүүгийн чадавхтай байх.",
            "Тухайн ажлыг гүйцэтгэх тусгай зөвшөөрөлтэй байх. Тухайн зөвшөөрлийн хугацаа ажил дуусах хүртэлх хугацаанд үргэлжлэхээр байх.",
            "Ажлыг захиалагчаас гаргасан зураг төслийн дагуу гүйцэтгэнэ"
        ],
        "license":[
            "БА-8.1 Барилга байгууламжийн засвар, засал чимэглэл, интерьер, орчны тохижилтийн ажил",
            "БА-6.1.Барилга байгууламжийн дотор ус хангамж, ариутгах татуургын шугам сүлжээ, тэдгээрийн тоног төхөөрөмж, гадна салбар шугам сүлжээний угсралт",
            "БА-6.2.Барилгын барилга байгууламжийн дотор халаалт, салхивчийн шугам сүлжээ, тэдгээрийн тоног төхөөрөмж, гадна салбар шугам сүлжээний угсралт",
            "БА-6.3.Барилга байгууламжийн дотор гэрэлтүүлэг, цахилгаан хангамжийн угсралт, тэдгээрийн тоног төхөөрөмж, тухайн барилгын гадна салбар шугам сүлжээний угсралт",
            "БА-6.4.Барилга байгууламжийн дотор холбоо дохиолол, интернет сүлжээ, гал унтраах болон галын аюулгүй дохиоллын систем угсралт, тэдгээрийн тоног төхөөрөмж, тухай барилгын гадна салбар шугам сүлжээний угсралт"
        ],
        "status":"яаралтай",
        "duration": "2 сар"
    }
]