    document.getElementById("txtUsuario").focus();
    function intro(evt, next_id) {

        switch (evt.keyCode) {
            case 37: //left arrow
            case 39: //right arrow
            case 33: //page up
            case 34: //page down
            case 36: //home
            case 35: //end
                break;
            case 13: //enter
                document.getElementById(next_id).focus();
                break;
            case 9: //tab
            case 27: //esc
            case 16: //shift
            case 17: //ctrl
            case 18: //alt
            case 20: //caps lock
            case 8: //backspace
            case 46: //delete
            case 38: //up arrow
            case 40: //down arrow
                break;
        }
        if (evt.keyCode == undefined)
            document.getElementById(next_id).focus();
    }
    function Accede(evt) {
        switch (evt.keyCode) {
            case 13: //enter
                validar_datos_acceso();
                break;
        }
    }

                            <input id="txtUsuario" style="width:310px" type="text" maxlength="50" onkeyup="intro(event, 'txtClave')" />
                            <br /><br />
                            <label>Contraseña</label><br />
                             <input id="txtClave" style="width:310px" type="password" maxlength="40" onkeyup="Accede(event)"/>
