<svg width="80" height="80" viewBox="0 0 80 80" fill="none" xmlns="http://www.w3.org/2000/svg">
<rect width="80" height="80" rx="10" fill="white"/>
<path d="M32.958 47.6V50.208C32.9576 50.443 33.0035 50.6758 33.0931 50.8931C33.1827 51.1103 33.3143 51.3078 33.4802 51.4742C33.6462 51.6406 33.8433 51.7727 34.0603 51.8629C34.2773 51.9531 34.51 51.9997 34.745 52H45.255C45.7288 51.9994 46.183 51.811 46.518 51.476C46.853 51.141 47.0415 50.6868 47.042 50.213V47.6H32.958ZM41.109 50.511H38.891V49.089H41.109V50.511Z" fill="#405558"/>
<path d="M45.255 28H34.745C34.2712 28.0005 33.817 28.189 33.482 28.524C33.147 28.859 32.9585 29.3132 32.958 29.787V32.4H47.042V29.787C47.0415 29.3132 46.853 28.859 46.518 28.524C46.183 28.189 45.7288 28.0005 45.255 28V28ZM40.264 30.911H36.993V29.485H40.264V30.911ZM43.008 30.911H41.689V29.485H43.007L43.008 30.911Z" fill="#405558"/>
<path d="M45.616 33.822H32.958V46.179H47.042V33.822H45.616ZM43.079 40.5L40.713 38.134V44.591H39.287V38.136L36.922 40.5L35.913 39.493L40 35.407L44.087 39.494L43.079 40.5Z" fill="#405558"/>
</svg>
