<svg width="100" height="100" viewBox="0 0 100 100" fill="none" xmlns="http://www.w3.org/2000/svg">
<rect opacity="0.08" width="100" height="100" rx="15" fill="#405558"/>
<path d="M22.4785 82H21.1113L19.4707 79.252C19.3203 78.9967 19.1745 78.7803 19.0332 78.6025C18.8919 78.4202 18.7461 78.2721 18.5957 78.1582C18.4499 78.0443 18.2904 77.9622 18.1172 77.9121C17.9486 77.8574 17.7572 77.8301 17.543 77.8301H16.5996V82H15.4512V72.1973H18.377C18.8053 72.1973 19.1995 72.252 19.5596 72.3613C19.9242 72.4661 20.2386 72.6279 20.5029 72.8467C20.7718 73.0654 20.9814 73.3389 21.1318 73.667C21.2822 73.9906 21.3574 74.3711 21.3574 74.8086C21.3574 75.1504 21.305 75.4648 21.2002 75.752C21.0999 76.0345 20.9541 76.2874 20.7627 76.5107C20.5758 76.734 20.348 76.9255 20.0791 77.085C19.8148 77.2399 19.5163 77.3607 19.1836 77.4473V77.4746C19.3477 77.5475 19.4889 77.6318 19.6074 77.7275C19.7305 77.8187 19.8467 77.9281 19.9561 78.0557C20.0654 78.1833 20.1725 78.3291 20.2773 78.4932C20.3867 78.6527 20.5075 78.8395 20.6396 79.0537L22.4785 82ZM16.5996 73.2363V76.791H18.1582C18.4453 76.791 18.7096 76.7477 18.9512 76.6611C19.1973 76.5745 19.4092 76.4515 19.5869 76.292C19.7646 76.1279 19.9036 75.9297 20.0039 75.6973C20.1042 75.4603 20.1543 75.196 20.1543 74.9043C20.1543 74.3802 19.9834 73.9723 19.6416 73.6807C19.3044 73.3844 18.8145 73.2363 18.1719 73.2363H16.5996ZM28.9111 78.7803H23.9688C23.987 79.5596 24.1966 80.1611 24.5977 80.585C24.9987 81.0088 25.5501 81.2207 26.252 81.2207C27.0404 81.2207 27.765 80.9609 28.4258 80.4414V81.4941C27.8105 81.9408 26.9971 82.1641 25.9854 82.1641C24.9964 82.1641 24.2194 81.8473 23.6543 81.2139C23.0892 80.5758 22.8066 79.6803 22.8066 78.5273C22.8066 77.4382 23.1143 76.5518 23.7295 75.8682C24.3493 75.18 25.1172 74.8359 26.0332 74.8359C26.9492 74.8359 27.6579 75.1322 28.1592 75.7246C28.6605 76.3171 28.9111 77.1396 28.9111 78.1924V78.7803ZM27.7627 77.8301C27.7581 77.1829 27.6009 76.6794 27.291 76.3193C26.9857 75.9593 26.5596 75.7793 26.0127 75.7793C25.484 75.7793 25.0352 75.9684 24.666 76.3467C24.2969 76.7249 24.069 77.2194 23.9824 77.8301H27.7627ZM30.1895 81.7471V80.5439C30.8001 80.9951 31.4723 81.2207 32.2061 81.2207C33.1904 81.2207 33.6826 80.8926 33.6826 80.2363C33.6826 80.0495 33.6393 79.8923 33.5527 79.7646C33.4707 79.6325 33.3568 79.5163 33.2109 79.416C33.0697 79.3158 32.901 79.2269 32.7051 79.1494C32.5137 79.0674 32.3063 78.9831 32.083 78.8965C31.7731 78.7734 31.4997 78.6504 31.2627 78.5273C31.0303 78.3997 30.8343 78.2585 30.6748 78.1035C30.5199 77.944 30.4014 77.764 30.3193 77.5635C30.2419 77.363 30.2031 77.1283 30.2031 76.8594C30.2031 76.5312 30.2783 76.2419 30.4287 75.9912C30.5791 75.736 30.7796 75.5241 31.0303 75.3555C31.2809 75.1823 31.5658 75.0524 31.8848 74.9658C32.2083 74.8792 32.541 74.8359 32.8828 74.8359C33.4889 74.8359 34.0312 74.9408 34.5098 75.1504V76.2852C33.9948 75.9479 33.4023 75.7793 32.7324 75.7793C32.5228 75.7793 32.3337 75.8044 32.165 75.8545C31.9964 75.9001 31.8506 75.9661 31.7275 76.0527C31.609 76.1393 31.5156 76.2441 31.4473 76.3672C31.3835 76.4857 31.3516 76.6178 31.3516 76.7637C31.3516 76.946 31.3835 77.0986 31.4473 77.2217C31.5156 77.3447 31.6136 77.4541 31.7412 77.5498C31.8688 77.6455 32.0238 77.7321 32.2061 77.8096C32.3883 77.887 32.5957 77.9714 32.8281 78.0625C33.138 78.181 33.416 78.304 33.6621 78.4316C33.9082 78.5547 34.1178 78.696 34.291 78.8555C34.4642 79.0104 34.5964 79.1904 34.6875 79.3955C34.7832 79.6006 34.8311 79.8444 34.8311 80.127C34.8311 80.4733 34.7536 80.7741 34.5986 81.0293C34.4482 81.2845 34.2454 81.4964 33.9902 81.665C33.735 81.8337 33.4411 81.959 33.1084 82.041C32.7757 82.123 32.4271 82.1641 32.0625 82.1641C31.3424 82.1641 30.7181 82.0251 30.1895 81.7471ZM39.8076 81.9316C39.5433 82.0775 39.1947 82.1504 38.7617 82.1504C37.5358 82.1504 36.9229 81.4668 36.9229 80.0996V75.957H35.7197V75H36.9229V73.291L38.0439 72.9287V75H39.8076V75.957H38.0439V79.9014C38.0439 80.3708 38.1237 80.7057 38.2832 80.9062C38.4427 81.1068 38.707 81.207 39.0762 81.207C39.3587 81.207 39.6025 81.1296 39.8076 80.9746V81.9316ZM46.3154 82H45.1943V80.9062H45.167C44.6794 81.7448 43.9616 82.1641 43.0137 82.1641C42.3164 82.1641 41.7695 81.9795 41.373 81.6104C40.9811 81.2412 40.7852 80.7513 40.7852 80.1406C40.7852 78.8327 41.5553 78.0716 43.0957 77.8574L45.1943 77.5635C45.1943 76.374 44.7135 75.7793 43.752 75.7793C42.9089 75.7793 42.1478 76.0664 41.4688 76.6406V75.4922C42.1569 75.0547 42.9499 74.8359 43.8477 74.8359C45.4928 74.8359 46.3154 75.7064 46.3154 77.4473V82ZM45.1943 78.459L43.5059 78.6914C42.9863 78.7643 42.5944 78.8942 42.3301 79.0811C42.0658 79.2633 41.9336 79.5892 41.9336 80.0586C41.9336 80.4004 42.0544 80.6807 42.2959 80.8994C42.542 81.1136 42.8678 81.2207 43.2734 81.2207C43.8294 81.2207 44.2874 81.027 44.6475 80.6396C45.012 80.2477 45.1943 79.7533 45.1943 79.1562V78.459ZM54.0879 82H52.9668V80.8926H52.9395C52.4746 81.7402 51.7546 82.1641 50.7793 82.1641C49.1113 82.1641 48.2773 81.1706 48.2773 79.1836V75H49.3916V79.0059C49.3916 80.4824 49.9567 81.2207 51.0869 81.2207C51.6338 81.2207 52.0827 81.0202 52.4336 80.6191C52.7891 80.2135 52.9668 79.6849 52.9668 79.0332V75H54.0879V82ZM60.0078 76.1348C59.8118 75.9844 59.5293 75.9092 59.1602 75.9092C58.6816 75.9092 58.2806 76.1348 57.957 76.5859C57.638 77.0371 57.4785 77.6523 57.4785 78.4316V82H56.3574V75H57.4785V76.4424H57.5059C57.6654 75.9502 57.9092 75.5674 58.2373 75.2939C58.5654 75.016 58.9323 74.877 59.3379 74.877C59.6296 74.877 59.8529 74.9089 60.0078 74.9727V76.1348ZM66.2354 82H65.1143V80.9062H65.0869C64.5993 81.7448 63.8815 82.1641 62.9336 82.1641C62.2363 82.1641 61.6895 81.9795 61.293 81.6104C60.901 81.2412 60.7051 80.7513 60.7051 80.1406C60.7051 78.8327 61.4753 78.0716 63.0156 77.8574L65.1143 77.5635C65.1143 76.374 64.6335 75.7793 63.6719 75.7793C62.8288 75.7793 62.0677 76.0664 61.3887 76.6406V75.4922C62.0768 75.0547 62.8698 74.8359 63.7676 74.8359C65.4128 74.8359 66.2354 75.7064 66.2354 77.4473V82ZM65.1143 78.459L63.4258 78.6914C62.9062 78.7643 62.5143 78.8942 62.25 79.0811C61.9857 79.2633 61.8535 79.5892 61.8535 80.0586C61.8535 80.4004 61.9743 80.6807 62.2158 80.8994C62.4619 81.1136 62.7878 81.2207 63.1934 81.2207C63.7493 81.2207 64.2074 81.027 64.5674 80.6396C64.932 80.2477 65.1143 79.7533 65.1143 79.1562V78.459ZM74.1582 82H73.0371V78.0078C73.0371 76.5221 72.4948 75.7793 71.4102 75.7793C70.8496 75.7793 70.3848 75.9912 70.0156 76.415C69.651 76.8343 69.4688 77.3652 69.4688 78.0078V82H68.3477V75H69.4688V76.1621H69.4961C70.0247 75.278 70.7904 74.8359 71.793 74.8359C72.5586 74.8359 73.1442 75.0843 73.5498 75.5811C73.9554 76.0732 74.1582 76.7865 74.1582 77.7207V82ZM79.5244 81.9316C79.2601 82.0775 78.9115 82.1504 78.4785 82.1504C77.2526 82.1504 76.6396 81.4668 76.6396 80.0996V75.957H75.4365V75H76.6396V73.291L77.7607 72.9287V75H79.5244V75.957H77.7607V79.9014C77.7607 80.3708 77.8405 80.7057 78 80.9062C78.1595 81.1068 78.4238 81.207 78.793 81.207C79.0755 81.207 79.3193 81.1296 79.5244 80.9746V81.9316ZM80.5977 81.7471V80.5439C81.2083 80.9951 81.8805 81.2207 82.6143 81.2207C83.5986 81.2207 84.0908 80.8926 84.0908 80.2363C84.0908 80.0495 84.0475 79.8923 83.9609 79.7646C83.8789 79.6325 83.765 79.5163 83.6191 79.416C83.4779 79.3158 83.3092 79.2269 83.1133 79.1494C82.9219 79.0674 82.7145 78.9831 82.4912 78.8965C82.1813 78.7734 81.9079 78.6504 81.6709 78.5273C81.4385 78.3997 81.2425 78.2585 81.083 78.1035C80.9281 77.944 80.8096 77.764 80.7275 77.5635C80.6501 77.363 80.6113 77.1283 80.6113 76.8594C80.6113 76.5312 80.6865 76.2419 80.8369 75.9912C80.9873 75.736 81.1878 75.5241 81.4385 75.3555C81.6891 75.1823 81.974 75.0524 82.293 74.9658C82.6165 74.8792 82.9492 74.8359 83.291 74.8359C83.8971 74.8359 84.4395 74.9408 84.918 75.1504V76.2852C84.403 75.9479 83.8105 75.7793 83.1406 75.7793C82.931 75.7793 82.7419 75.8044 82.5732 75.8545C82.4046 75.9001 82.2588 75.9661 82.1357 76.0527C82.0173 76.1393 81.9238 76.2441 81.8555 76.3672C81.7917 76.4857 81.7598 76.6178 81.7598 76.7637C81.7598 76.946 81.7917 77.0986 81.8555 77.2217C81.9238 77.3447 82.0218 77.4541 82.1494 77.5498C82.277 77.6455 82.432 77.7321 82.6143 77.8096C82.7965 77.887 83.0039 77.9714 83.2363 78.0625C83.5462 78.181 83.8242 78.304 84.0703 78.4316C84.3164 78.5547 84.526 78.696 84.6992 78.8555C84.8724 79.0104 85.0046 79.1904 85.0957 79.3955C85.1914 79.6006 85.2393 79.8444 85.2393 80.127C85.2393 80.4733 85.1618 80.7741 85.0068 81.0293C84.8564 81.2845 84.6536 81.4964 84.3984 81.665C84.1432 81.8337 83.8493 81.959 83.5166 82.041C83.1839 82.123 82.8353 82.1641 82.4707 82.1641C81.7507 82.1641 81.1263 82.0251 80.5977 81.7471Z" fill="#4C5D5C"/>
<g clip-path="url(#clip0)">
<path d="M58.3199 28.4817L57.8927 27.0737C57.6868 26.4687 57.2967 25.9432 56.777 25.5712C56.2574 25.1991 55.6343 24.999 54.9951 24.999C54.356 24.999 53.7329 25.1991 53.2133 25.5712C52.6936 25.9432 52.3034 26.4687 52.0975 27.0737L51.6703 28.4817C51.31 29.6699 51.2344 30.9261 51.4495 32.1489C51.5468 32.6565 51.7569 33.1357 52.0643 33.5511C52.3717 33.9665 52.7686 34.3075 53.2255 34.5489L52.7455 45.2689C52.7138 45.5646 52.7448 45.8637 52.8366 46.1466C52.9284 46.4295 53.0789 46.6898 53.2783 46.9105C53.4846 47.1362 53.7334 47.3191 54.0104 47.4486C54.2874 47.5782 54.5872 47.6519 54.8926 47.6656C55.1981 47.6793 55.5033 47.6326 55.7908 47.5283C56.0782 47.424 56.3423 47.2641 56.5679 47.0577C56.6191 47.0108 56.6682 46.9617 56.7151 46.9105C56.9107 46.6958 57.0592 46.4425 57.151 46.1669C57.2427 45.8914 57.2758 45.5996 57.2479 45.3105L56.7679 34.5489C57.2243 34.3072 57.6205 33.966 57.9274 33.5506C58.2342 33.1352 58.4438 32.6562 58.5407 32.1489C58.7559 30.9261 58.6803 29.6699 58.3199 28.4817ZM57.2271 31.9169C57.1574 32.2817 56.9927 32.6216 56.7497 32.9025C56.5068 33.1834 56.1941 33.3953 55.8431 33.5169C55.7113 33.5664 55.5985 33.6564 55.5209 33.774C55.4433 33.8915 55.4049 34.0306 55.4111 34.1713L55.9199 45.4161C55.9314 45.5251 55.9194 45.6353 55.885 45.7393C55.8505 45.8433 55.7942 45.9387 55.7199 46.0193C55.527 46.2102 55.2666 46.3173 54.9951 46.3173C54.7237 46.3173 54.4633 46.2102 54.2703 46.0193C54.1935 45.9331 54.1363 45.8312 54.1026 45.7207C54.0689 45.6102 54.0595 45.4938 54.0751 45.3793L54.5775 34.1697C54.5838 34.029 54.5454 33.8899 54.4678 33.7724C54.3902 33.6548 54.2774 33.5648 54.1455 33.5153C53.7946 33.3937 53.4819 33.1818 53.239 32.9009C52.996 32.62 52.8313 32.2801 52.7615 31.9153C52.5841 30.9015 52.6471 29.8603 52.9455 28.8753L53.3727 27.4657C53.4949 27.1339 53.7158 26.8476 54.0058 26.6454C54.2958 26.4431 54.6408 26.3347 54.9943 26.3347C55.3479 26.3347 55.6929 26.4431 55.9829 26.6454C56.2728 26.8476 56.4938 27.1339 56.6159 27.4657L57.0431 28.8753C57.3431 29.8605 57.4077 30.9022 57.2319 31.9169H57.2271Z" fill="#405558"/>
<path d="M48 25C47.823 25 47.6533 25.0703 47.5282 25.1954C47.403 25.3205 47.3328 25.4902 47.3328 25.6672V31.3904L45.528 33.1952C45.4621 33.2609 45.4106 33.3398 45.377 33.4266C45.3434 33.5134 45.3283 33.6062 45.3328 33.6992L45.9168 45.3664C45.9238 45.4909 45.9051 45.6155 45.8619 45.7325C45.8187 45.8495 45.7518 45.9564 45.6656 46.0464C45.4894 46.2225 45.2506 46.3214 45.0016 46.3214C44.7525 46.3214 44.5137 46.2225 44.3376 46.0464C44.2512 45.9564 44.1843 45.8496 44.1411 45.7326C44.0979 45.6156 44.0792 45.4909 44.0864 45.3664L44.6735 33.6992C44.678 33.6062 44.6629 33.5134 44.6293 33.4266C44.5957 33.3398 44.5442 33.2609 44.4784 33.1952L42.6672 31.3904V25.6672C42.6588 25.4961 42.5849 25.3348 42.4608 25.2167C42.3368 25.0985 42.172 25.0327 42.0008 25.0327C41.8295 25.0327 41.6647 25.0985 41.5407 25.2167C41.4166 25.3348 41.3427 25.4961 41.3344 25.6672V31.6672C41.3343 31.7548 41.3515 31.8416 41.385 31.9226C41.4185 32.0036 41.4676 32.0772 41.5296 32.1392L43.32 33.9312L42.752 45.304C42.7308 45.6032 42.7697 45.9036 42.8663 46.1876C42.9628 46.4716 43.1151 46.7335 43.3142 46.9578C43.5133 47.1822 43.7552 47.3645 44.0258 47.4941C44.2963 47.6237 44.5899 47.698 44.8895 47.7126C45.1891 47.7272 45.4887 47.6818 45.7705 47.5791C46.0523 47.4764 46.3108 47.3185 46.5308 47.1145C46.7507 46.9106 46.9278 46.6648 47.0515 46.3915C47.1752 46.1183 47.2431 45.8231 47.2511 45.5232C47.2511 45.4507 47.2511 45.3776 47.2511 45.304L46.6832 33.9312L48.4735 32.1392C48.5355 32.0772 48.5846 32.0036 48.6181 31.9226C48.6516 31.8416 48.6688 31.7548 48.6688 31.6672V25.6672C48.6688 25.5794 48.6514 25.4926 48.6178 25.4115C48.5842 25.3305 48.5349 25.2568 48.4728 25.1949C48.4106 25.1329 48.3369 25.0838 48.2558 25.0503C48.1746 25.0169 48.0877 24.9998 48 25Z" fill="#405558"/>
<path d="M44 25C43.823 25 43.6533 25.0703 43.5282 25.1954C43.4031 25.3205 43.3328 25.4902 43.3328 25.6672V31C43.3411 31.1711 43.415 31.3324 43.5391 31.4505C43.6631 31.5687 43.8279 31.6345 43.9992 31.6345C44.1705 31.6345 44.3352 31.5687 44.4593 31.4505C44.5833 31.3324 44.6572 31.1711 44.6656 31V25.6672C44.6656 25.4905 44.5955 25.3211 44.4707 25.196C44.3459 25.0709 44.1766 25.0004 44 25Z" fill="#405558"/>
<path d="M46 25C45.823 25 45.6533 25.0703 45.5282 25.1954C45.4031 25.3205 45.3328 25.4902 45.3328 25.6672V31C45.3411 31.1711 45.415 31.3324 45.5391 31.4505C45.6631 31.5687 45.8279 31.6345 45.9992 31.6345C46.1705 31.6345 46.3352 31.5687 46.4593 31.4505C46.5833 31.3324 46.6572 31.1711 46.6656 31V25.6672C46.6656 25.4905 46.5955 25.3211 46.4707 25.196C46.3459 25.0709 46.1766 25.0004 46 25Z" fill="#405558"/>
<path d="M50 15C46.0444 15 42.1776 16.173 38.8886 18.3706C35.5996 20.5682 33.0362 23.6918 31.5224 27.3463C30.0087 31.0009 29.6126 35.0222 30.3843 38.9018C31.156 42.7814 33.0608 46.3451 35.8579 49.1421C38.6549 51.9392 42.2186 53.844 46.0982 54.6157C49.9778 55.3874 53.9992 54.9913 57.6537 53.4776C61.3082 51.9638 64.4318 49.4004 66.6294 46.1114C68.827 42.8224 70 38.9556 70 35C70 29.6957 67.8929 24.6086 64.1421 20.8579C60.3914 17.1071 55.3043 15 50 15V15ZM50 53.6672C46.308 53.6672 42.6989 52.5724 39.6291 50.5212C36.5593 48.47 34.1666 45.5546 32.7538 42.1436C31.3409 38.7326 30.9712 34.9793 31.6915 31.3582C32.4118 27.7371 34.1897 24.411 36.8003 21.8003C39.411 19.1896 42.7371 17.4118 46.3582 16.6915C49.9793 15.9712 53.7327 16.3409 57.1436 17.7538C60.5546 19.1666 63.47 21.5593 65.5212 24.6291C67.5724 27.6989 68.6672 31.308 68.6672 35C68.6672 39.9508 66.7005 44.6989 63.1997 48.1997C59.6989 51.7005 54.9509 53.6672 50 53.6672Z" fill="#405558"/>
<path d="M52.1648 47.5134C52.1474 47.3376 52.061 47.1758 51.9245 47.0637C51.788 46.9515 51.6126 46.898 51.4368 46.915H51.4112C50.4725 47.024 49.5243 47.024 48.5856 46.915C48.4099 46.8938 48.233 46.9432 48.0938 47.0524C47.9545 47.1616 47.8644 47.3217 47.8432 47.4974C47.822 47.6731 47.8714 47.85 47.9806 47.9892C48.0899 48.1284 48.2499 48.2186 48.4256 48.2398C49.4663 48.3613 50.5177 48.3613 51.5584 48.2398C51.646 48.2321 51.7312 48.2073 51.8092 48.1666C51.8871 48.1259 51.9563 48.0702 52.0126 48.0027C52.069 47.9352 52.1115 47.8572 52.1376 47.7732C52.1637 47.6892 52.1729 47.6009 52.1648 47.5134Z" fill="#405558"/>
<path d="M60.1999 26.4095C60.0861 26.2742 59.9233 26.1897 59.7472 26.1744C59.5711 26.1591 59.3962 26.2143 59.2607 26.3279C59.1257 26.4419 59.0415 26.6048 59.0265 26.7809C59.0115 26.957 59.067 27.1318 59.1807 27.2671C61.1196 29.5685 62.1231 32.5145 61.9921 35.5209C61.8611 38.5274 60.6053 41.3749 58.4735 43.4991C58.4064 43.5596 58.3523 43.6332 58.3145 43.7153C58.2767 43.7974 58.2559 43.8864 58.2535 43.9767C58.2511 44.0671 58.2671 44.157 58.3005 44.241C58.334 44.325 58.3841 44.4014 58.4479 44.4654C58.5117 44.5294 58.5879 44.5798 58.6718 44.6135C58.7557 44.6472 58.8455 44.6635 58.9359 44.6614C59.0263 44.6594 59.1153 44.6389 59.1976 44.6014C59.2798 44.5638 59.3536 44.51 59.4143 44.4431C61.7825 42.0831 63.1775 38.9195 63.323 35.5794C63.4685 32.2393 62.3539 28.9664 60.1999 26.4095Z" fill="#405558"/>
<path d="M53.144 22.0401C50.5411 21.4165 47.8114 21.5836 45.304 22.5201C45.1385 22.582 45.0044 22.7072 44.9312 22.868C44.858 23.0288 44.8517 23.2122 44.9136 23.3777C44.9756 23.5432 45.1007 23.6773 45.2616 23.7505C45.4224 23.8237 45.6057 23.83 45.7712 23.7681C48.0294 22.9246 50.4879 22.7741 52.832 23.3361C52.9171 23.3571 53.0055 23.3611 53.0922 23.348C53.1788 23.3348 53.2621 23.3047 53.3371 23.2594C53.4121 23.2141 53.4775 23.1544 53.5295 23.0839C53.5815 23.0133 53.619 22.9332 53.64 22.8481C53.661 22.763 53.6651 22.6746 53.6519 22.5879C53.6388 22.5013 53.6087 22.418 53.5634 22.343C53.5181 22.268 53.4584 22.2026 53.3878 22.1506C53.3173 22.0986 53.2371 22.0611 53.152 22.0401H53.144Z" fill="#405558"/>
<path d="M41.4991 43.4674C39.4863 41.4458 38.2595 38.7734 38.0387 35.9292C37.8179 33.0851 38.6176 30.2553 40.2943 27.9474C40.3525 27.8779 40.396 27.7973 40.422 27.7105C40.4481 27.6237 40.4562 27.5325 40.4458 27.4425C40.4354 27.3524 40.4068 27.2655 40.3618 27.1868C40.3167 27.1082 40.256 27.0396 40.1836 26.9852C40.1111 26.9308 40.0283 26.8917 39.9402 26.8703C39.8521 26.849 39.7606 26.8458 39.6713 26.861C39.5819 26.8762 39.4966 26.9094 39.4205 26.9586C39.3444 27.0079 39.2792 27.0721 39.2287 27.1474L39.2159 27.1602C37.3517 29.7257 36.4629 32.8717 36.7092 36.0334C36.9556 39.1951 38.3208 42.1656 40.5599 44.4114C40.6219 44.4734 40.6955 44.5225 40.7765 44.5561C40.8574 44.5896 40.9442 44.6069 41.0319 44.6069C41.1196 44.6069 41.2064 44.5896 41.2873 44.5561C41.3683 44.5225 41.4419 44.4734 41.5039 44.4114C41.5659 44.3494 41.6151 44.2758 41.6486 44.1948C41.6821 44.1138 41.6994 44.027 41.6994 43.9394C41.6994 43.8517 41.6821 43.7649 41.6486 43.6839C41.6151 43.6029 41.5659 43.5294 41.5039 43.4674H41.4991Z" fill="#405558"/>
</g>
<defs>
<clipPath id="clip0">
<rect width="40" height="40" fill="white" transform="translate(30 15)"/>
</clipPath>
</defs>
</svg>
