{
  "images" : [
    {
      "idiom" : "universal",
      "filename" : "owngift~universal@1x.png",
      "scale" : "1x"
    },
    {
      "filename" : "owngift~universal@2x.png",
      "idiom" : "universal",
      "scale" : "2x"
    },
    {
      "filename" : "owngift~universal@3x.png",
      "scale" : "3x",
      "idiom" : "universal"
    }
  ],
  "info" : {
    "author" : "xcode",
    "version" : 1
  }
}