\relax 
\catcode `"\active 
\bibstyle{unsrtnat}
\select@language{ukrainian}
\@writefile{toc}{\select@language{ukrainian}}
\@writefile{lof}{\select@language{ukrainian}}
\@writefile{lot}{\select@language{ukrainian}}
\@writefile{toc}{\contentsline {section}{\IeC {\CYRV }\IeC {\cyrs }\IeC {\cyrt }\IeC {\cyru }\IeC {\cyrp }}{5}}
\citation{Rusov2005,Tarasov1993,Tarasov-disser}
\@writefile{toc}{\contentsline {section}{\numberline {1.}\IeC {\CYRN }\IeC {\cyra }\IeC {\cyrz }\IeC {\cyrv }\IeC {\cyra } \IeC {\cyrp }\IeC {\cyre }\IeC {\cyrr }\IeC {\cyrsh }\IeC {\cyro }\IeC {\cyrg }\IeC {\cyro } \IeC {\cyrr }\IeC {\cyro }\IeC {\cyrz }\IeC {\cyrd }\IeC {\cyrii }\IeC {\cyrl }\IeC {\cyru }}{6}}
\@writefile{toc}{\contentsline {subsection}{\numberline {1.1.}\IeC {\CYRP }\IeC {\cyre }\IeC {\cyrr }\IeC {\cyrsh }\IeC {\cyri }\IeC {\cyrishrt } \IeC {\cyrp }\IeC {\cyra }\IeC {\cyrr }\IeC {\cyra }\IeC {\cyrg }\IeC {\cyrr }\IeC {\cyra }\IeC {\cyrf }}{6}}
\newlabel{eq01}{{1.1}{6}}
\newlabel{eq02}{{1.2}{6}}
\@writefile{lof}{\contentsline {figure}{\numberline {1.1}{\ignorespaces \IeC {\CYRII }\IeC {\cyrl }\IeC {\cyryu }\IeC {\cyrs }\IeC {\cyrt }\IeC {\cyrr }\IeC {\cyra }\IeC {\cyrc }\IeC {\cyrii }\IeC {\cyrya } \IeC {\cyrii }\IeC {\cyrz } \IeC {\cyrz }\IeC {\cyra }\IeC {\cyrs }\IeC {\cyrt }\IeC {\cyro }\IeC {\cyrs }\IeC {\cyru }\IeC {\cyrv }\IeC {\cyra }\IeC {\cyrn }\IeC {\cyrn }\IeC {\cyrya }\IeC {\cyrm } \IeC {\cyrr }\IeC {\cyra }\IeC {\cyrs }\IeC {\cyrt }\IeC {\cyrr }\IeC {\cyro }\IeC {\cyrv }\IeC {\cyro }\IeC {\cyryi } \IeC {\cyrg }\IeC {\cyrr }\IeC {\cyra }\IeC {\cyrf }\IeC {\cyrii }\IeC {\cyrk }\IeC {\cyri }.}}{7}}
\newlabel{fig01}{{1.1}{7}}
\@writefile{toc}{\contentsline {subsection}{\numberline {1.2.}\IeC {\CYRD }\IeC {\cyrr }\IeC {\cyru }\IeC {\cyrg }\IeC {\cyri }\IeC {\cyrishrt } \IeC {\cyrp }\IeC {\cyra }\IeC {\cyrr }\IeC {\cyra }\IeC {\cyrg }\IeC {\cyrr }\IeC {\cyra }\IeC {\cyrf }}{7}}
\@writefile{lof}{\contentsline {figure}{\numberline {1.2}{\ignorespaces \IeC {\CYRII }\IeC {\cyrl }\IeC {\cyryu }\IeC {\cyrs }\IeC {\cyrt }\IeC {\cyrr }\IeC {\cyra }\IeC {\cyrc }\IeC {\cyrii }\IeC {\cyrya } \IeC {\cyrii }\IeC {\cyrz } \IeC {\cyrz }\IeC {\cyra }\IeC {\cyrs }\IeC {\cyrt }\IeC {\cyro }\IeC {\cyrs }\IeC {\cyru }\IeC {\cyrv }\IeC {\cyra }\IeC {\cyrn }\IeC {\cyrn }\IeC {\cyrya }\IeC {\cyrm } \IeC {\cyrv }\IeC {\cyre }\IeC {\cyrk }\IeC {\cyrt }\IeC {\cyro }\IeC {\cyrr }\IeC {\cyrn }\IeC {\cyro }\IeC {\cyryi } \IeC {\cyrg }\IeC {\cyrr }\IeC {\cyra }\IeC {\cyrf }\IeC {\cyrii }\IeC {\cyrk }\IeC {\cyri }.}}{8}}
\newlabel{fig02}{{1.2}{8}}
\citation{Rusov2002,Rusov2004a,Rusov2007,Rusov2004b,Tarasov2002,Tarasov2001}
\@writefile{toc}{\contentsline {section}{\numberline {2.}\IeC {\CYRN }\IeC {\cyra }\IeC {\cyrz }\IeC {\cyrv }\IeC {\cyra } \IeC {\cyrd }\IeC {\cyrr }\IeC {\cyru }\IeC {\cyrg }\IeC {\cyro }\IeC {\cyrg }\IeC {\cyro } \IeC {\cyrr }\IeC {\cyro }\IeC {\cyrz }\IeC {\cyrd }\IeC {\cyrii }\IeC {\cyrl }\IeC {\cyru }}{10}}
\@writefile{lot}{\contentsline {table}{\numberline {2.1}{\ignorespaces \IeC {\CYRD }\IeC {\cyre }\IeC {\cyrm }\IeC {\cyro }\IeC {\cyrn }\IeC {\cyrs }\IeC {\cyrt }\IeC {\cyrr }\IeC {\cyra }\IeC {\cyrc }\IeC {\cyrii }\IeC {\cyrishrt }\IeC {\cyrn }\IeC {\cyra } \IeC {\cyrt }\IeC {\cyra }\IeC {\cyrb }\IeC {\cyrl }\IeC {\cyri }\IeC {\cyrc }\IeC {\cyrya }}}{10}}
\newlabel{tab01}{{2.1}{10}}
\citation{Rusov2005,Tarasov1993,Tarasov-disser,Rusov2004b,Tarasov2002,Tarasov2001}
\@writefile{toc}{\contentsline {section}{\numberline {3.}\IeC {\CYRO }\IeC {\cyrh }\IeC {\cyro }\IeC {\cyrr }\IeC {\cyro }\IeC {\cyrn }\IeC {\cyra } \IeC {\cyrp }\IeC {\cyrr }\IeC {\cyra }\IeC {\cyrc }\IeC {\cyrii }}{12}}
\@writefile{toc}{\contentsline {section}{\IeC {\CYRV }\IeC {\cyri }\IeC {\cyrs }\IeC {\cyrn }\IeC {\cyro }\IeC {\cyrv }\IeC {\cyrk }\IeC {\cyri }}{13}}
\bibcite{Rusov2005}{{1}{}{{}}{{}}}
\bibcite{Tarasov1993}{{2}{}{{}}{{}}}
\bibcite{Tarasov-disser}{{3}{}{{}}{{}}}
\bibcite{Rusov2002}{{4}{}{{}}{{}}}
\bibcite{Rusov2004a}{{5}{}{{}}{{}}}
\bibcite{Rusov2007}{{6}{}{{}}{{}}}
\bibcite{Rusov2004b}{{7}{}{{}}{{}}}
\bibcite{Tarasov2002}{{8}{}{{}}{{}}}
\bibcite{Tarasov2001}{{9}{}{{}}{{}}}
\providecommand\NAT@force@numbers{}\NAT@force@numbers
\@writefile{toc}{\contentsline {section}{\IeC {\CYRD }\IeC {\cyro }\IeC {\cyrd }\IeC {\cyra }\IeC {\cyrt }\IeC {\cyrk }\IeC {\cyri }}{15}}
\@writefile{toc}{\contentsline {section}{\IeC {\CYRL }\IeC {\cyrii }\IeC {\cyrt }\IeC {\cyre }\IeC {\cyrr }\IeC {\cyra }\IeC {\cyrt }\IeC {\cyru }\IeC {\cyrr }\IeC {\cyra }}{15}}
