﻿{
  "iisSettings": {
    "windowsAuthentication": false,
    "anonymousAuthentication": true,
    "iisExpress": {
      "applicationUrl": "http://localhost:7749/",
      "sslPort": 0
    }
  },
  "profiles": {
    "IIS Express": {
      "commandName": "IISExpress",
      "launchBrowser": false,
      "launchUrl": "http://localhost:7749/testing",
      "environmentVariables": {
        "ASPNETCORE_ENVIRONMENT": "Development"
      }
    },
    "OnlineAuctionSystem.GoodsService": {
      "commandName": "Project",
      "launchBrowser": false,
      "launchUrl": "http://localhost:7749",
      "applicationUrl": "https://localhost:7749",
      "environmentVariables": {
        "ASPNETCORE_URLS": "http://+:7749",
        "ASPNETCORE_ENVIRONMENT": "Development"
      }
    }
  }
}