<?xml version="1.0" encoding="UTF-8"?>
<session version="1.0">
<refactoring accessors="true" comment="Delete element from project &apos;afconn.ui.apps&apos;&#x0D;&#x0A;- Original project: &apos;afconn.ui.apps&apos;&#x0D;&#x0A;- Original element: &apos;afconn.ui.apps/src/main/content/jcr_root/apps.afconn.components.page.mysqlTemplate&apos;" description="Delete element" element1="/src\/main\/content\/jcr_root&lt;apps.afconn.components.page.mysqlTemplate" element2="/src\/main\/content\/jcr_root&lt;apps.afconn.components.page" elements="2" flags="589830" id="org.eclipse.jdt.ui.delete" resources="0" stamp="1512801337247" subPackages="false" version="1.0"/>
</session>