Apply suggestion to docs/configuration/runner_autoscale_aws/index.md

38 jobs for !1786 with patch-4 in 26 minutes and 8 seconds (queued for 3 seconds)
latest detached
Status Job ID Name Coverage
  Prebuild
passed #412941417
clone test repo

00:01:05

passed #412941413
docker
helper images

00:08:21

passed #412941419
gitlab-org
tests definitions

00:04:23

 
  Test
passed #412941437
check feature flags docs

00:01:29

passed #412941442
check mocks

00:03:55

passed #412941439
check modules

00:01:29

passed #412941444
code_quality

00:01:49

passed #412941435
docs lint

00:01:01

passed #412941565
git 1.7.1

00:02:34

passed #412941422
allowed to fail
license_management

00:06:22

passed #412941448
docker
unit test 1/8

00:03:56

passed #412941450
docker
unit test 2/8

00:03:46

failed #412941458
docker
unit test 3/8

00:13:34

passed #412941462
docker
unit test 4/8

00:04:41

passed #412941465
docker
unit test 5/8

00:03:28

passed #412941516
docker
unit test 6/8

00:03:05

passed #412941523
docker
unit test 7/8

00:03:11

passed #412941526
docker
unit test 8/8

00:03:03

passed #412941530
docker allowed to fail
unit test with race 1/8

00:04:48

passed #412941538
docker allowed to fail
unit test with race 2/8

00:04:28

passed #412941540
docker allowed to fail
unit test with race 3/8

00:14:39

failed #412941543
docker allowed to fail
unit test with race 4/8

00:05:19

passed #412941546
docker allowed to fail
unit test with race 5/8

00:04:15

passed #412941551
docker allowed to fail
unit test with race 6/8

00:03:46

passed #412941559
docker allowed to fail
unit test with race 7/8

00:04:23

passed #412941562
docker allowed to fail
unit test with race 8/8

00:03:43

 
  Coverage
passed #412941580
race conditions detector

00:01:25

passed #412941572
test coverage report

00:01:30

64.1%
passed #412941575
test junit report

00:01:31

 
  Build
skipped #412941583
gitlab-org
binaries darwin/386 darwin/amd64
skipped #412941585
gitlab-org
binaries freebsd/386 freebsd/amd64 freebsd/arm
skipped #412941594
gitlab-org
binaries linux/386 linux/amd64 linux/arm linux/arm64
skipped #412941597
gitlab-org
binaries windows/386 windows/amd64
 
  Package
failed #412941601
gitlab-org
package-deb

00:01:39

failed #412941603
gitlab-org
package-rpm

00:01:32

 
  Release
passed #412941618
static QA

00:00:40

 
  Docs
skipped #412941632
allowed to fail manual
review-docs-cleanup
skipped #412941629
allowed to fail manual
review-docs-deploy
 
Name Stage Failure
failed
package-deb Package
chmod 755 packaging/root/usr/share/gitlab-runner/*
# Building Debian compatible packages...
make package-deb-fpm ARCH=amd64 PACKAGE_ARCH=amd64 RUNNER_BINARY=out/binaries/gitlab-runner-linux-amd64
make[1]: Entering directory '/builds/onivek/gitlab-runner'
{:timestamp=>"2020-01-23T15:26:22.191724+0000", :message=>"Invalid package configuration: Cannot chdir to 'out/binaries'. Does it exist?", :level=>:error}
make[1]: *** [Makefile.package.mk:26: package-deb-fpm] Error 1
make[1]: Leaving directory '/builds/onivek/gitlab-runner'
make: *** [Makefile.package.mk:13: package-deb] Error 2
ERROR: Job failed: exit code 1
failed
package-rpm Package
chmod 755 packaging/root/usr/share/gitlab-runner/*
# Building RedHat compatible packages...
make package-rpm-fpm ARCH=amd64 PACKAGE_ARCH=amd64 RUNNER_BINARY=out/binaries/gitlab-runner-linux-amd64
make[1]: Entering directory '/builds/onivek/gitlab-runner'
{:timestamp=>"2020-01-23T15:26:08.946762+0000", :message=>"Invalid package configuration: Cannot chdir to 'out/binaries'. Does it exist?", :level=>:error}
make[1]: *** [Makefile.package.mk:29: package-rpm-fpm] Error 1
make[1]: Leaving directory '/builds/onivek/gitlab-runner'
make: *** [Makefile.package.mk:20: package-rpm] Error 2
ERROR: Job failed: exit code 1
failed
unit test 3/8 Test
PASS
coverage: 24.2% of statements
ok gitlab.com/gitlab-org/gitlab-runner/executors/docker/internal/volumes 0.020s coverage: 24.2% of statements
make: *** [Makefile:115: parallel_test_execute] Error 1
Uploading artifacts...
.cover/*: found 10 matching files
.testoutput/*: found 10 matching files

Uploading artifacts to coordinator... ok
id=412941458 responseStatus=201 Created token=A-LkNzNB
ERROR: Job failed: exit code 1
failed
unit test with race 4/8 Test
PASS
coverage: 54.5% of statements
ok gitlab.com/gitlab-org/gitlab-runner/executors/shell 7.966s coverage: 54.5% of statements
make: *** [Makefile:115: parallel_test_execute] Error 1
Uploading artifacts...
.cover/*: found 10 matching files
.testoutput/*: found 10 matching files

Uploading artifacts to coordinator... ok
id=412941543 responseStatus=201 Created token=xhH7irLx
ERROR: Job failed: exit code 1