\set ECHO none
INFO:  EXECUTE WAS REVOKED FROM PUBLIC ROLE IN FUNCTION set_config 
 shared_preload_libraries 
--------------------------
 noset
(1 row)

 current_user 
--------------
 appuser
(1 row)

 shared_preload_libraries 
--------------------------
 noset
(1 row)

 noset.enabled 
---------------
 on
(1 row)

ERROR:  permission denied to set/reset parameter 'set work_mem ='1GB';'
 work_mem 
----------
 4MB
(1 row)

ERROR:  permission denied for function set_config
 work_mem 
----------
 4MB
(1 row)

ERROR:  permission denied for function set_config
 work_mem 
----------
 4MB
(1 row)

ERROR:  permission denied to set/reset parameter 'set jit = off;'
 jit 
-----
 on
(1 row)

 maintenance_work_mem 
----------------------
 1GB
(1 row)

 current_user 
--------------
 appuser2
(1 row)

 shared_preload_libraries 
--------------------------
 noset
(1 row)

 noset.enabled 
---------------
 off
(1 row)

 work_mem 
----------
 1GB
(1 row)

 set_config 
------------
 2GB
(1 row)

 work_mem 
----------
 2GB
(1 row)

