{
	"info": {
		"_postman_id": "ceccd843-0cab-4ff5-8c4b-2f2fdb6d4fb9",
		"name": "Capstone-2",
		"schema": "https://schema.getpostman.com/json/collection/v2.1.0/collection.json"
	},
	"item": [
		{
			"name": "USER REGISTRATION",
			"request": {
				"method": "POST",
				"header": [],
				"body": {
					"mode": "raw",
					"raw": "{\r\n    \"email\" : \"ceciliagarcia@mail.com\",\r\n    \"password\" : \"cecilia1234\"\r\n}",
					"options": {
						"raw": {
							"language": "json"
						}
					}
				},
				"url": {
					"raw": "localhost:4001/users/register",
					"host": [
						"localhost"
					],
					"port": "4001",
					"path": [
						"users",
						"register"
					]
				}
			},
			"response": []
		},
		{
			"name": "USER AUTHENTICATION",
			"request": {
				"method": "POST",
				"header": [],
				"body": {
					"mode": "raw",
					"raw": "{\r\n    \"email\" : \"ceciliagarcia@mail.com\",\r\n    \"password\" : \"cecilia1234\"\r\n}",
					"options": {
						"raw": {
							"language": "json"
						}
					}
				},
				"url": {
					"raw": "localhost:4001/users/login",
					"host": [
						"localhost"
					],
					"port": "4001",
					"path": [
						"users",
						"login"
					]
				}
			},
			"response": []
		},
		{
			"name": "CREATE PRODUCT",
			"request": {
				"auth": {
					"type": "bearer",
					"bearer": [
						{
							"key": "token",
							"value": "eyJhbGciOiJIUzI1NiIsInR5cCI6IkpXVCJ9.eyJpZCI6IjYzY2Y2NjJkY2FlYjUwMmEzYzljMThiOSIsImVtYWlsIjoiam9obmplZmZlcnNvbm9uZ0BtYWlsLmNvbSIsImlzQWRtaW4iOnRydWUsImlhdCI6MTY3NDUzOTU2MH0.e3jvyviM-AH0Ti21V-v4iLxiNAkdFj9JdNvMUqvr7eg",
							"type": "string"
						}
					]
				},
				"method": "POST",
				"header": [],
				"body": {
					"mode": "raw",
					"raw": "{\r\n    \"name\" : \"samsung galaxy s22+\",\r\n    \"description\" : \"Made by Samsung \",\r\n    \"price\" : 75000\r\n}",
					"options": {
						"raw": {
							"language": "json"
						}
					}
				},
				"url": {
					"raw": "localhost:4001/products/create",
					"host": [
						"localhost"
					],
					"port": "4001",
					"path": [
						"products",
						"create"
					]
				}
			},
			"response": []
		},
		{
			"name": "GET ALL PRODUCTS",
			"request": {
				"method": "GET",
				"header": [],
				"url": {
					"raw": "localhost:4001/products/all",
					"host": [
						"localhost"
					],
					"port": "4001",
					"path": [
						"products",
						"all"
					]
				}
			},
			"response": []
		},
		{
			"name": "SPECIFIC PRODUCT",
			"request": {
				"method": "GET",
				"header": []
			},
			"response": []
		},
		{
			"name": "UPDATE PRODUCT",
			"request": {
				"auth": {
					"type": "bearer",
					"bearer": [
						{
							"key": "token",
							"value": "eyJhbGciOiJIUzI1NiIsInR5cCI6IkpXVCJ9.eyJpZCI6IjYzY2Y2NjJkY2FlYjUwMmEzYzljMThiOSIsImVtYWlsIjoiam9obmplZmZlcnNvbm9uZ0BtYWlsLmNvbSIsImlzQWRtaW4iOnRydWUsImlhdCI6MTY3NDUzOTkzNH0.5G3T8j_X2fmztl38RhzlLcWuNdXJKQD_xoCJpu6QpVQ",
							"type": "string"
						}
					]
				},
				"method": "PUT",
				"header": [],
				"body": {
					"mode": "raw",
					"raw": "{\r\n    \"price\" : 35000\r\n}",
					"options": {
						"raw": {
							"language": "json"
						}
					}
				},
				"url": {
					"raw": "localhost:4001/products/63cf735dc3a232b629f6e260/update",
					"host": [
						"localhost"
					],
					"port": "4001",
					"path": [
						"products",
						"63cf735dc3a232b629f6e260",
						"update"
					]
				}
			},
			"response": []
		},
		{
			"name": "ARCHIVE PRODUCT",
			"request": {
				"auth": {
					"type": "bearer",
					"bearer": [
						{
							"key": "token",
							"value": "eyJhbGciOiJIUzI1NiIsInR5cCI6IkpXVCJ9.eyJpZCI6IjYzY2Y2NjJkY2FlYjUwMmEzYzljMThiOSIsImVtYWlsIjoiam9obmplZmZlcnNvbm9uZ0BtYWlsLmNvbSIsImlzQWRtaW4iOnRydWUsImlhdCI6MTY3NDUzOTkzNH0.5G3T8j_X2fmztl38RhzlLcWuNdXJKQD_xoCJpu6QpVQ",
							"type": "string"
						}
					]
				},
				"method": "PUT",
				"header": [],
				"url": {
					"raw": "localhost:4001/products/63cf735dc3a232b629f6e260/archive",
					"host": [
						"localhost"
					],
					"port": "4001",
					"path": [
						"products",
						"63cf735dc3a232b629f6e260",
						"archive"
					]
				}
			},
			"response": []
		},
		{
			"name": "CHECKOUT",
			"request": {
				"auth": {
					"type": "bearer",
					"bearer": [
						{
							"key": "token",
							"value": "eyJhbGciOiJIUzI1NiIsInR5cCI6IkpXVCJ9.eyJpZCI6IjYzY2Y3MjFiZjJjMGZiY2U0MjdkZmE4OSIsImVtYWlsIjoiY2VjaWxpYWdhcmNpYUBtYWlsLmNvbSIsImlzQWRtaW4iOmZhbHNlLCJpYXQiOjE2NzQ1NDg5MTJ9.FWfaQKeqegH6SEpBBPmvCbFbCiRh50hAZG4WU_T6qZY",
							"type": "string"
						}
					]
				},
				"method": "POST",
				"header": [],
				"body": {
					"mode": "raw",
					"raw": "{\r\n    \"userId\" : \"63cf721bf2c0fbce427dfa89\",\r\n    \"productId\" : \"63cf735dc3a232b629f6e260\",\r\n    \"quantity\" : 3\r\n}",
					"options": {
						"raw": {
							"language": "json"
						}
					}
				},
				"url": {
					"raw": "localhost:4001/users/checkout",
					"host": [
						"localhost"
					],
					"port": "4001",
					"path": [
						"users",
						"checkout"
					]
				}
			},
			"response": []
		},
		{
			"name": "USER DETAILS",
			"request": {
				"auth": {
					"type": "bearer",
					"bearer": [
						{
							"key": "token",
							"value": "eyJhbGciOiJIUzI1NiIsInR5cCI6IkpXVCJ9.eyJpZCI6IjYzY2Y2NjJkY2FlYjUwMmEzYzljMThiOSIsImVtYWlsIjoiam9obmplZmZlcnNvbm9uZ0BtYWlsLmNvbSIsImlzQWRtaW4iOnRydWUsImlhdCI6MTY3NDU0NzI4Mn0.320_C7z0IBDXXQ7VxBVdMevYVH1hJNH83pJa2n7d_vc",
							"type": "string"
						}
					]
				},
				"method": "POST",
				"header": [],
				"body": {
					"mode": "raw",
					"raw": "{\r\n    \"id\" : \"63cf721bf2c0fbce427dfa89\"\r\n}",
					"options": {
						"raw": {
							"language": "json"
						}
					}
				},
				"url": {
					"raw": "localhost:4001/users/details",
					"host": [
						"localhost"
					],
					"port": "4001",
					"path": [
						"users",
						"details"
					]
				}
			},
			"response": []
		}
	]
}