{
  "tasksRunnerOptions": {
    "default": {
      "runner": "nx/tasks-runners/default",
      "options": {
        "cacheableOperations": [
          "build",
          "check",
          "lint",
          "typecheck",
          "test"
        ]
      }
    }
  },
  "targetDefaults": {
    "build": {
      "dependsOn": [
        "^build"
      ],
      "outputs": [
        "{projectRoot}/dist"
      ]
    },
    "test": {
      "inputs": [
        "default",
        "^default"
      ]
    }
  },
  "defaultBase": "master"
}
