<svg width="64" height="64" viewBox="0 0 64 64" fill="none" xmlns="http://www.w3.org/2000/svg">
<g clip-path="url(#clip0)">
<path d="M37.9709 18.1138C37.4683 17.8609 37.0542 18.117 37.0542 18.6796V41.0878L46.2495 45.6839C47.261 46.1897 48.0829 45.8356 48.0829 44.8937V23.3168C48.0829 23.2251 48.0323 23.1429 47.9501 23.1018L37.9709 18.1138Z" fill="#F4F4F4"/>
<path d="M26.0255 35.5719L36.5168 18.5279C36.8108 18.0474 37.4651 17.8609 37.9709 18.1138L47.9627 23.1082C48.026 23.1398 48.0513 23.2219 48.0133 23.282L37.0542 41.0878L26.0255 35.5719Z" fill="#CCCDCD"/>
<path d="M16.5268 18.4172C15.6859 17.9968 15.4015 18.3066 15.8946 19.1063L26.0255 35.5719L37.051 41.0847L26.0508 23.2061C26.035 23.1808 26.0129 23.1619 25.9876 23.1461L16.5268 18.4172Z" fill="#A6A6A6"/>
<path d="M26.0255 44.8937C26.0255 45.8325 25.3396 46.256 24.4988 45.8388L15.9167 41.5462C15.4109 41.2933 15 40.6263 15 40.0637V19.021C15 18.2687 15.55 17.9305 16.2201 18.2655L25.9686 23.1366C26.0034 23.1556 26.0287 23.1903 26.0287 23.2314V44.8937H26.0255Z" fill="#797979"/>
</g>
<defs>
<clipPath id="clip0">
<rect width="33.0797" height="28" fill="white" transform="translate(15 18)"/>
</clipPath>
</defs>
</svg>
