<?xml version="1.0" encoding="utf-8"?>
<!-- Generator: Adobe Illustrator 24.1.1, SVG Export Plug-In . SVG Version: 6.00 Build 0)  -->
<svg version="1.1" id="Layer_1" xmlns="http://www.w3.org/2000/svg" xmlns:xlink="http://www.w3.org/1999/xlink" x="0px" y="0px"
	 viewBox="0 0 194 194" style="enable-background:new 0 0 194 194;" xml:space="preserve">
<style type="text/css">
	.st0{fill:#FFFFFF;}
</style>
<path class="st0" d="M97,0C43.46,0,0,43.46,0,97s43.46,97,97,97s97-43.46,97-97S150.54,0,97,0z M106.7,164.9H87.3v-19.4h19.4V164.9z
	 M126.78,89.72l-8.73,8.92c-6.98,7.08-11.35,12.9-11.35,27.45H87.3v-4.85c0-10.67,4.36-20.37,11.35-27.45l12.03-12.22
	c3.59-3.49,5.72-8.34,5.72-13.68c0-10.67-8.73-19.4-19.4-19.4s-19.4,8.73-19.4,19.4H58.2c0-21.44,17.36-38.8,38.8-38.8
	s38.8,17.36,38.8,38.8C135.8,76.44,132.31,84.2,126.78,89.72z"/>
</svg>
