<?xml version="1.0" encoding="utf-8"?>
<!-- Generator: Adobe Illustrator 25.0.1, SVG Export Plug-In . SVG Version: 6.00 Build 0)  -->
<svg version="1.1" id="svg" xmlns="http://www.w3.org/2000/svg" xmlns:xlink="http://www.w3.org/1999/xlink" x="0px" y="0px"
	 viewBox="0 0 400 400" style="enable-background:new 0 0 400 400;" xml:space="preserve">
<style type="text/css">
	.st0{fill-rule:evenodd;clip-rule:evenodd;fill:#FFFFFF;}
</style>
<g id="svgg">
	<path id="path0" class="st0" d="M196.4,21.5c-0.8,1.9-25.3,43.1-54.5,91.4c-29.1,48.4-53.2,88.6-53.5,89.3
		c-0.4,1,15.4,10.9,55.5,34.5L200,270l56-33.1c40.3-23.8,55.9-33.5,55.5-34.6C309.5,197,200.5,18,199.4,18
		C198.6,18,197.2,19.6,196.4,21.5 M88.6,226.1c2.2,3.7,111,156.8,111.4,156.8c0.8,0,112-157.2,111.6-157.7
		c-0.4-0.4-104.4,60.8-108.7,64l-2.7,2l-53.8-31.8C116.7,242,91.4,227,90.1,226.1C87.9,224.7,87.7,224.7,88.6,226.1"/>
</g>
</svg>
