{
  "image": "<IMAGE_URL>",
  "external_url": "https://uniwine.exchange",
  "description": "Dynamically priced, regeneratively produced wine.",
  "name": "WineSwap Edition 0 (<SHIP_STATUS>)",
  "attributes": [
    {
      "trait_type": "Dryness",
      "value": "Dry"
    },
    {
      "trait_type": "Color",
      "value": "Red"
    },
    {
      "trait_type": "Made In",
      "value": "Portugal"
    },
    {
      "trait_type": "Volume",
      "value": "0.75l"
    },
    {
      "trait_type": "Rarity",
      "value": "1 / 108"
    },
    {
      "trait_type": "Artwork Number",
      "value": "<ARTWORK_NUMBER>"
    },
    {
      "trait_type": "Version",
      "value": 0,
      "display_type": "number"
    }
  ],
  "background_color": "722F37"
}