<svg id="Logo" xmlns="http://www.w3.org/2000/svg" width="180" height="180" viewBox="0 0 180 180" fill="currentColor">
  <path id="n8n" d="M155.98149,47.54823a17.06,17.06,0,0,0-16.4903,12.82036h-23.7327A16.90641,16.90641,0,0,0,98.87035,77.25673a8.45321,8.45321,0,0,1-8.44409,8.44409H87.04052a17.01557,17.01557,0,0,0-32.98059,0H40.50068a17.04242,17.04242,0,1,0,0,8.44409H54.07613a17.01521,17.01521,0,0,0,32.94.15427h3.41825a8.45321,8.45321,0,0,1,8.44409,8.44409,16.90641,16.90641,0,0,0,16.88814,16.88814h5.52924a17.04242,17.04242,0,1,0,0-8.44409h-5.52924a8.45322,8.45322,0,0,1-8.4441-8.4441A16.84468,16.84468,0,0,0,101.48474,90.004a16.82993,16.82993,0,0,0,5.83778-12.73919,8.45322,8.45322,0,0,1,8.4441-8.44409h23.7327a17.0342,17.0342,0,1,0,16.48217-21.27253ZM24.02659,98.5131A8.59836,8.59836,0,1,1,32.625,89.91474,8.6074,8.6074,0,0,1,24.02659,98.5131Zm46.53984,0a8.59836,8.59836,0,1,1,8.59836-8.59836A8.60741,8.60741,0,0,1,70.56643,98.5131Zm67.2116,8.28982a8.59837,8.59837,0,1,1-8.59836,8.59837A8.60741,8.60741,0,0,1,137.778,106.80292ZM155.98149,73.189a8.59837,8.59837,0,1,1,8.59836-8.59836A8.60741,8.60741,0,0,1,155.98149,73.189Z" />
</svg>
