<svg width="32" height="32" viewBox="0 0 32 32" fill="none" xmlns="http://www.w3.org/2000/svg">
<path d="M27.3962 24.9829L27.384 24.9748C27.3432 25.0373 27.2996 25.0972 27.2479 25.1571C27.3051 25.104 27.3513 25.0482 27.3962 24.9829Z" fill="black"/>
<path d="M10.4236 23.5952V23.5939L10.4249 23.5965L10.4236 23.5952Z" fill="black"/>
<path d="M31.0503 14.0587C31.0114 12.331 30.4711 10.6519 29.495 9.22577C28.519 7.79965 27.1493 6.68806 25.5529 6.02636C23.9564 5.36466 22.202 5.18138 20.5033 5.49884C18.8045 5.81631 17.2347 6.62082 15.985 7.81442C14.341 6.23008 12.1463 5.3454 9.86314 5.34662C5.01324 5.34662 1.06394 9.27415 0.945587 14.1662V14.2356C0.945587 17.9563 2.2992 21.2676 3.53038 23.5381C4.05053 24.4929 4.63031 25.4139 5.26628 26.2957C5.50435 26.6263 5.70705 26.8889 5.85398 27.0752L6.03764 27.2956L6.09341 27.3623L6.1111 27.3827L6.1179 27.3909C6.36227 27.6762 6.66109 27.91 6.99688 28.0784C7.33267 28.2469 7.69868 28.3468 8.07351 28.3721C8.44835 28.3974 8.82447 28.3478 9.17987 28.226C9.53528 28.1042 9.86284 27.9128 10.1434 27.6629C10.7124 27.1542 11.0594 26.4428 11.1103 25.6812C11.1612 24.9196 10.9117 24.1684 10.4155 23.5885L10.3964 23.5654L10.2917 23.4375C10.1951 23.315 10.0495 23.1259 9.86858 22.8756C9.37894 22.1949 8.93231 21.4843 8.53128 20.7479C7.53682 18.9182 6.66071 16.615 6.65119 14.2751C6.67223 13.4342 7.02214 12.6351 7.62579 12.0493C8.22944 11.4636 9.0387 11.1379 9.87982 11.1422C10.7209 11.1464 11.5268 11.4804 12.1245 12.0722C12.7222 12.6641 13.0639 13.4667 13.0764 14.3077C13.0875 14.742 13.1958 15.1683 13.3934 15.5552C13.6334 16.1745 14.0817 16.6908 14.6611 17.0154C15.2406 17.3399 15.915 17.4525 16.5684 17.3336C17.2219 17.2148 17.8135 16.872 18.2416 16.3642C18.6696 15.8564 18.9074 15.2153 18.914 14.5512V14.1689C18.9437 13.3367 19.2951 12.5485 19.8944 11.9702C20.4936 11.3919 21.2939 11.0688 22.1266 11.0688C22.9594 11.0688 23.7596 11.3919 24.3589 11.9702C24.9581 12.5485 25.3096 13.3367 25.3393 14.1689C25.3311 16.049 24.7284 17.9006 24.0523 19.363C23.7816 19.9483 23.4773 20.5175 23.1408 21.0676C23.0197 21.2662 22.9218 21.4159 22.8579 21.5098C22.8266 21.5574 22.8034 21.59 22.7912 21.6077L22.7803 21.6213L22.7531 21.6635C23.2068 21.0874 23.8652 20.7084 24.5913 20.6055C25.3174 20.5025 26.0552 20.6836 26.6512 21.1109C27.2471 21.5383 27.6553 22.179 27.7908 22.8997C27.9263 23.6204 27.7786 24.3656 27.3785 24.9802L27.3908 24.9884V24.9802L27.4044 24.9611L27.4452 24.904C27.4778 24.8564 27.5227 24.7938 27.5812 24.7149C27.6873 24.5571 27.8316 24.3367 28.0016 24.0605C28.4535 23.3211 28.8623 22.5562 29.226 21.7696C30.0966 19.8868 31.0421 17.1673 31.0421 14.1349V14.0655L31.0503 14.0587Z" fill="white"/>
<path d="M24.9924 20.582C24.5052 20.5796 24.0256 20.7017 23.5989 20.9369C23.1723 21.1721 22.8129 21.5124 22.5549 21.9256C22.2969 22.3388 22.1488 22.8111 22.1247 23.2977C22.1007 23.7842 22.2014 24.2689 22.4174 24.7055C22.6334 25.1421 22.9574 25.5163 23.3588 25.7924C23.7601 26.0685 24.2254 26.2375 24.7104 26.2831C25.1954 26.3288 25.684 26.2497 26.1298 26.0533C26.5756 25.8569 26.9638 25.5498 27.2575 25.1611C27.3024 25.1013 27.3459 25.0414 27.3935 24.9789C27.6729 24.5482 27.8306 24.0499 27.85 23.5369C27.8694 23.0239 27.7498 22.5152 27.5037 22.0646C27.2577 21.614 26.8944 21.2384 26.4523 20.9774C26.0102 20.7164 25.5057 20.5798 24.9924 20.582V20.582Z" fill="#939393"/>
</svg>
