{
  "$schema": "../node_modules/@angular-devkit/schematics/collection-schema.json",
  "schematics": {
    "ng-add": {
      "description": "Install Angular Wars project setup",
      "factory": "./ng-add/index#projectSetup",
      "schema": "./ng-add/schema.json"
    },
    "configure-jest": {
      "description": "Configure Jest as test runner",
      "factory": "./configure-jest/index#configureJest"
    },
    "configure-prettier": {
      "description": "Configure prettier",
      "factory": "./configure-prettier/index#configurePrettier"
    },
    "thematic": {
      "description": "A template generation example",
      "factory": "./thematic/index#thematic",
      "schema": "./thematic/schema.json"
    }
  }
}
