{
  "properties": {
    "name": {
      "type": "string",
      "description": "The name of the component.",
      "$default": {
        "$source": "argv",
        "index": 0
      },
      "x-prompt": "What name would you like to use for the component ?"
    },
    "themes": {
      "type": "array",
      "default": [],
      "x-prompt": {
        "type": "list",
        "multiselect": true,
        "items": [
          "sport",
          "history",
          "science"
        ],
        "message": "What themes would you like ?"
      }
    }
  },
  "required": ["name"]
}
