(footprint "LL-34" (version 20211014) (generator pcbnew)
  (layer "F.Cu")
  (tedit 623EAA0F)
  (attr through_hole)
  (fp_text reference "REF**" (at 0 -1.778 unlocked) (layer "F.SilkS")
    (effects (font (size 1 1) (thickness 0.15)))
    (tstamp 56c6a2ea-aeac-4754-8ebb-b3a3eb87f455)
  )
  (fp_text value "LL-34" (at 0 2.032 unlocked) (layer "F.Fab")
    (effects (font (size 1 1) (thickness 0.15)))
    (tstamp fdcbac8e-adc0-4d24-b3c1-13980d501e58)
  )
  (fp_text user "${REFERENCE}" (at 0 0 unlocked) (layer "F.Fab")
    (effects (font (size 1 1) (thickness 0.15)))
    (tstamp 6e2357db-53c7-42f3-9183-6d706e7a3788)
  )
  (fp_line (start 0.508 -0.508) (end 0.508 0.508) (layer "F.SilkS") (width 0.1778) (tstamp 17804e2d-6c51-41ac-9d20-3c2d9aae06d8))
  (fp_line (start -0.254 0) (end 0.508 -0.508) (layer "F.SilkS") (width 0.1778) (tstamp 57fa4fcb-8301-4b0d-a9a8-f1c0aee7cd2b))
  (fp_line (start 0.508 0.508) (end -0.254 0) (layer "F.SilkS") (width 0.1778) (tstamp fb83df52-a600-4bdb-85b2-f2892fe43e4a))
  (fp_rect (start -2.54 -1.016) (end 2.54 1.016) (layer "F.SilkS") (width 0.1778) (fill none) (tstamp 15f13640-60e5-49b7-b452-9388e582e460))
  (fp_rect (start -1.016 -1.016) (end -0.762 1.016) (layer "F.SilkS") (width 0.12) (fill solid) (tstamp d2a999cc-5a45-4c28-b5c7-6a8ae0e5e927))
  (fp_rect (start -2.794 -1.27) (end 2.794 1.27) (layer "F.CrtYd") (width 0.0254) (fill none) (tstamp 77eae4d0-9516-40dd-9624-a670263b4d22))
  (fp_rect (start -2.54 -1.016) (end 2.54 1.016) (layer "F.Fab") (width 0.1) (fill none) (tstamp 68dcda30-da3d-4cf4-b1c5-6118d0309bc9))
  (pad "A" smd rect (at 1.778 0) (size 1.016 1.524) (layers "F.Cu" "F.Paste" "F.Mask")
    (solder_mask_margin 0.0762) (tstamp 663f49c9-05d0-489d-8276-856943fef1fe))
  (pad "C" smd rect (at -1.778 0) (size 1.016 1.524) (layers "F.Cu" "F.Paste" "F.Mask")
    (solder_mask_margin 0.0762) (tstamp de3a5326-3cc4-4db5-a501-ea88de46f9d2))
)
