(footprint "L1206" (version 20211014) (generator pcbnew)
  (layer "F.Cu")
  (tedit 61A5977B)
  (descr "Capacitor SMD 1206 (3216 Metric), square (rectangular) end terminal, IPC_7351 nominal, (Body size source: IPC-SM-782 page 76, https://www.pcb-3d.com/wordpress/wp-content/uploads/ipc-sm-782a_amendment_1_and_2.pdf), generated with kicad-footprint-generator")
  (tags "capacitor")
  (attr smd)
  (fp_text reference "REF**" (at 0 -1.905) (layer "F.SilkS")
    (effects (font (size 1.016 1.016) (thickness 0.1778)))
    (tstamp c919aef1-7173-474f-9a09-fae57350bef3)
  )
  (fp_text value "L1206" (at 0 1.905) (layer "F.Fab")
    (effects (font (size 1.016 1.016) (thickness 0.1778)))
    (tstamp d43355f6-6b77-4c5f-99d6-bbb42e90bd50)
  )
  (fp_text user "${REFERENCE}" (at 0 0) (layer "F.Fab")
    (effects (font (size 1.016 1.016) (thickness 0.1778)))
    (tstamp 3230cfe3-c287-4e0e-8b82-7e7745297457)
  )
  (fp_text user "Dimension: 3.2x1.6mm" (at 0 7.62 unlocked) (layer "User.1")
    (effects (font (size 1.016 1.016) (thickness 0.1778) italic) (justify left))
    (tstamp 0df7459d-fcc0-404c-bbad-59115ad1b6f8)
  )
  (fp_text user "Footprint: 1206 (3216 Metric)" (at 0 5.588 unlocked) (layer "User.1")
    (effects (font (size 1.016 1.016) (thickness 0.1778) italic) (justify left))
    (tstamp 10f5f7c0-de4e-4fdc-9ba4-9f0354bff3c3)
  )
  (fp_text user "Auth: Thanh Duong" (at 0 9.652 unlocked) (layer "User.1")
    (effects (font (size 1.016 1.016) (thickness 0.1778) italic) (justify left))
    (tstamp cbca149f-1931-4f31-8c59-6f30b1a81842)
  )
  (fp_line (start 2.159001 -0.762) (end 2.158999 0.762001) (layer "F.SilkS") (width 0.1778) (tstamp 09d217d3-dc7c-4866-a19d-470cb508d7da))
  (fp_line (start 1.905 -1.016001) (end 2.159 -0.761999) (layer "F.SilkS") (width 0.1778) (tstamp 0f60a3ea-bbc4-44e9-9303-22cf6f5bdb53))
  (fp_line (start -0.762 1.016) (end -1.905 1.016) (layer "F.SilkS") (width 0.1778) (tstamp 3c2cd26a-dac8-483c-adce-40744e5df5e2))
  (fp_line (start -2.158999 -0.762) (end -2.158997 0.762) (layer "F.SilkS") (width 0.1778) (tstamp 455d70bf-ca1e-446b-b9b7-587de6021f7c))
  (fp_line (start 1.905 1.016) (end 0.762 1.016) (layer "F.SilkS") (width 0.1778) (tstamp 59bd5de4-7c59-4a3c-a5c2-b681257f0b9f))
  (fp_line (start -0.762 -1.016) (end -1.905 -1.016) (layer "F.SilkS") (width 0.1778) (tstamp 59efd10e-4037-4063-82bc-fa8364b2ce70))
  (fp_line (start -2.158999 -0.762) (end -1.904999 -1.015998) (layer "F.SilkS") (width 0.1778) (tstamp 62cb2f2b-9ed1-4374-975d-ab848ad09b07))
  (fp_line (start 1.904999 -1.015997) (end 0.762 -1.016) (layer "F.SilkS") (width 0.1778) (tstamp 7d69b33d-0c6f-4da9-872f-154a6f85b200))
  (fp_line (start 1.905 1.016) (end 2.159 0.762002) (layer "F.SilkS") (width 0.1778) (tstamp be94286e-087c-4fa5-b12c-6402ed6cb634))
  (fp_line (start -1.905 1.016) (end -2.159 0.761998) (layer "F.SilkS") (width 0.1778) (tstamp f963a04e-db24-4539-a37c-c9e109e044c9))
  (fp_rect (start -2.159 -1.016) (end 2.159 1.016) (layer "F.CrtYd") (width 0.0254) (fill none) (tstamp 478d81cc-6668-4230-a7c8-4238281b8d89))
  (fp_rect (start -1.6 -0.8) (end 1.6 0.8) (layer "F.Fab") (width 0.1) (fill none) (tstamp 75cf6da9-4bb3-4f2f-8bb5-6479d01823d4))
  (pad "1" smd rect (at -1.397 0) (size 1.143 1.7018) (layers "F.Cu" "F.Paste" "F.Mask")
    (solder_mask_margin 0.0762) (tstamp 687651df-ae42-4169-8fa5-de2f3c1c0243))
  (pad "2" smd rect (at 1.397 0) (size 1.143 1.7018) (layers "F.Cu" "F.Paste" "F.Mask")
    (solder_mask_margin 0.0762) (tstamp 552f6611-4e02-468b-a629-d6395b702183))
  (model "${KICAD6_3DMODEL_DIR}/Inductor_SMD.3dshapes/L_1206_3216Metric.step"
    (offset (xyz 0 0 0))
    (scale (xyz 1 1 1))
    (rotate (xyz 0 0 0))
  )
)
