(footprint "HDR_P2.54_2x12" (version 20210722) (generator pcbnew) (layer "F.Cu")
  (tedit 6176BE95)
  (descr "Through hole straight pin header, 1x20, 2.54mm pitch, single row")
  (tags "Through hole pin header THT 1x20 2.54mm single row")
  (attr through_hole)
  (fp_text reference "REF**" (at 0 0 90) (layer "F.SilkS")
    (effects (font (size 1.016 1.016) (thickness 0.1778)))
    (tstamp 3d38d2af-b121-4e8d-b8f4-d4040beeadae)
  )
  (fp_text value "HDR_P2.54_2x12" (at 0 0 90) (layer "F.Fab")
    (effects (font (size 1 1) (thickness 0.15)))
    (tstamp a787553e-5d66-4b9e-b88a-067a36a55c4e)
  )
  (fp_text user "${REFERENCE}" (at 0 0 90) (layer "F.Fab")
    (effects (font (size 1 1) (thickness 0.15)))
    (tstamp 3b826fb7-74f0-466f-bd07-49aa05b669ca)
  )
  (fp_line (start -2.54 -15.24) (end -2.54 15.24) (layer "F.SilkS") (width 0.1778) (tstamp 7df5498e-80a3-42ac-87cb-54d223ed629e))
  (fp_line (start -2.54 -15.24) (end 2.54 -15.24) (layer "F.SilkS") (width 0.1778) (tstamp 8511c7e4-ef91-4e8b-ba56-96c5acc6e633))
  (fp_line (start -2.54 -14.732) (end -2.032 -15.24) (layer "F.SilkS") (width 0.1778) (tstamp 868981bf-d70f-4e1d-a44f-628389cb371a))
  (fp_line (start -2.54 15.24) (end 2.54 15.24) (layer "F.SilkS") (width 0.1778) (tstamp a0de9bfe-7565-4498-8316-bb189463d107))
  (fp_line (start 2.54 -15.24) (end 2.54 15.24) (layer "F.SilkS") (width 0.1778) (tstamp d3264c5f-0e41-4e16-83ea-99e20b1944ab))
  (fp_rect (start -3.048 -15.748) (end 3.048 15.748) (layer "F.CrtYd") (width 0.0254) (fill none) (tstamp 982331d2-1de3-4265-a9ff-f277dcd9cc71))
  (fp_line (start 2.54 15.24) (end -2.54 15.24) (layer "F.Fab") (width 0.1) (tstamp 1f517df2-691a-4cc2-91f6-354d16f58ee2))
  (fp_line (start -2.54 15.24) (end -2.54 -14.732) (layer "F.Fab") (width 0.1) (tstamp 96d061de-33d0-45ce-9667-4cc8f6376887))
  (fp_line (start -2.032 -15.24) (end 2.54 -15.24) (layer "F.Fab") (width 0.1) (tstamp 9a98eedc-f8ed-455f-8da5-d5a17614fb9a))
  (fp_line (start 2.54 -15.24) (end 2.54 15.24) (layer "F.Fab") (width 0.1) (tstamp 9c650c03-b117-45a1-b637-15a06e07613c))
  (fp_line (start -2.54 -14.732) (end -2.032 -15.24) (layer "F.Fab") (width 0.1) (tstamp c5fccbed-c999-4757-8be8-0bf7403b7a05))
  (pad "1" thru_hole roundrect locked (at -1.27 -13.97) (size 1.778 1.778) (drill 1.016) (layers *.Cu *.Mask) (roundrect_rratio 0.1) (tstamp 34700a09-b51b-400a-8f52-7b7253aebf7c))
  (pad "2" thru_hole oval locked (at 1.27 -13.97) (size 1.778 1.778) (drill 1.016) (layers *.Cu *.Mask) (tstamp 853de5c8-1f32-4955-b702-e99a743e54ab))
  (pad "3" thru_hole oval locked (at -1.27 -11.43) (size 1.778 1.778) (drill 1.016) (layers *.Cu *.Mask) (tstamp 5fe51e4e-2087-4ff6-9a87-ecdf66a6da5d))
  (pad "4" thru_hole oval locked (at 1.27 -11.43) (size 1.778 1.778) (drill 1.016) (layers *.Cu *.Mask) (tstamp 07a1f387-9b57-4479-99a5-c935acc3ebc4))
  (pad "5" thru_hole oval (at -1.27 -8.89) (size 1.778 1.778) (drill 1.016) (layers *.Cu *.Mask) (tstamp 697cf597-7478-4955-96ba-8123c6b3fe41))
  (pad "6" thru_hole oval (at 1.27 -8.89) (size 1.778 1.778) (drill 1.016) (layers *.Cu *.Mask) (tstamp 5dbe8560-00ed-42cf-bcd6-2af64434987d))
  (pad "7" thru_hole oval (at -1.27 -6.35) (size 1.778 1.778) (drill 1.016) (layers *.Cu *.Mask) (tstamp 4c3a6a7a-9630-4505-b7bf-d00c1e98cd05))
  (pad "8" thru_hole oval (at 1.27 -6.35) (size 1.778 1.778) (drill 1.016) (layers *.Cu *.Mask) (tstamp 09dd578d-7f54-4bde-a470-bf8c72ef931d))
  (pad "9" thru_hole oval (at -1.27 -3.81) (size 1.778 1.778) (drill 1.016) (layers *.Cu *.Mask) (tstamp 2ea2f273-8e4b-453d-bc2c-e36351f810ec))
  (pad "10" thru_hole oval (at 1.27 -3.81) (size 1.778 1.778) (drill 1.016) (layers *.Cu *.Mask) (tstamp f2156174-8728-48d3-a01f-156c22cf1046))
  (pad "11" thru_hole oval (at -1.27 -1.27) (size 1.778 1.778) (drill 1.016) (layers *.Cu *.Mask) (tstamp d8985d75-d1dc-4fab-9e02-8aa0ca02baaf))
  (pad "12" thru_hole oval (at 1.27 -1.27) (size 1.778 1.778) (drill 1.016) (layers *.Cu *.Mask) (tstamp 4618902d-2b7e-49be-880b-7f90402e21fd))
  (pad "13" thru_hole oval (at -1.27 1.27) (size 1.778 1.778) (drill 1.016) (layers *.Cu *.Mask) (tstamp 72aab0d9-4440-4fd7-b03b-af42396b27eb))
  (pad "14" thru_hole oval (at 1.27 1.27) (size 1.778 1.778) (drill 1.016) (layers *.Cu *.Mask) (tstamp 47ab845c-fc36-48f2-9381-05f995296919))
  (pad "15" thru_hole oval (at -1.27 3.81) (size 1.778 1.778) (drill 1.016) (layers *.Cu *.Mask) (tstamp ade1e51c-4acc-4a4c-a6a0-0bfe5e32acec))
  (pad "16" thru_hole oval (at 1.27 3.81) (size 1.778 1.778) (drill 1.016) (layers *.Cu *.Mask) (tstamp 5bf472bc-c312-4342-aa7c-8a92dc4a9b51))
  (pad "17" thru_hole oval (at -1.27 6.35) (size 1.778 1.778) (drill 1.016) (layers *.Cu *.Mask) (tstamp ea34b8f9-4eb3-4750-bff3-2710d67690e9))
  (pad "18" thru_hole oval (at 1.27 6.35) (size 1.778 1.778) (drill 1.016) (layers *.Cu *.Mask) (tstamp d067af61-069b-453d-b8b9-554bd896346c))
  (pad "19" thru_hole oval (at -1.27 8.89) (size 1.778 1.778) (drill 1.016) (layers *.Cu *.Mask) (tstamp 9dd3e277-646c-4f54-b535-e27aa2d1fecb))
  (pad "20" thru_hole oval (at 1.27 8.89) (size 1.778 1.778) (drill 1.016) (layers *.Cu *.Mask) (tstamp b7c24054-4087-4755-a814-5e0042c644e1))
  (pad "21" thru_hole oval (at -1.27 11.43) (size 1.778 1.778) (drill 1.016) (layers *.Cu *.Mask) (tstamp 4f10e414-f41f-4fc7-aba0-06e54f9dde41))
  (pad "22" thru_hole oval (at 1.27 11.43) (size 1.778 1.778) (drill 1.016) (layers *.Cu *.Mask) (tstamp f919d37f-2015-4b3b-baa4-9549f2639d06))
  (pad "23" thru_hole oval (at -1.27 13.97) (size 1.778 1.778) (drill 1.016) (layers *.Cu *.Mask) (tstamp 6a155f38-6dfb-4ea5-8bdd-1582ea26e073))
  (pad "24" thru_hole oval (at 1.27 13.97) (size 1.778 1.778) (drill 1.016) (layers *.Cu *.Mask) (tstamp da51d87b-5aa4-4389-b998-d1410012633c))
  (model "${KICAD6_3DMODEL_DIR}/Connector_PinHeader_2.54mm.3dshapes/PinHeader_2x12_P2.54mm_Vertical.wrl"
    (offset (xyz -1.27 13.97 0))
    (scale (xyz 1 1 1))
    (rotate (xyz 0 0 0))
  )
)
