(footprint "R0805S" (version 20210722) (generator pcbnew) (layer "F.Cu")
  (tedit 617563A0)
  (descr "Capacitor SMD 0805 (2012 Metric), square (rectangular) end terminal, IPC_7351 nominal, (Body size source: IPC-SM-782 page 76, https://www.pcb-3d.com/wordpress/wp-content/uploads/ipc-sm-782a_amendment_1_and_2.pdf, https://docs.google.com/spreadsheets/d/1BsfQQcO9C6DZCsRaXUlFlo91Tg2WpOkGARC1WS5S8t0/edit?usp=sharing), generated with kicad-footprint-generator")
  (tags "capacitor")
  (attr smd)
  (fp_text reference "REF**" (at 0 0) (layer "F.SilkS")
    (effects (font (size 1.016 1.016) (thickness 0.1778)))
    (tstamp f4bc8d1a-c35f-43eb-a6ad-e5caac707cc1)
  )
  (fp_text value "R0805S" (at 0 0) (layer "F.Fab")
    (effects (font (size 0.508 0.508) (thickness 0.127)))
    (tstamp a5fd4310-fc59-47d4-8b6f-24e783e4454a)
  )
  (fp_text user "${REFERENCE}" (at 0 0) (layer "F.Fab")
    (effects (font (size 0.508 0.508) (thickness 0.127)))
    (tstamp 39b44c4c-e7fa-42b9-be06-3806c8ebc304)
  )
  (fp_line (start 1.524 -0.889) (end 1.524 0.889) (layer "F.SilkS") (width 0.1778) (tstamp 1e92619b-548e-4049-bb5f-dbb0483bc162))
  (fp_line (start 0.508 -0.889) (end 1.524 -0.889) (layer "F.SilkS") (width 0.1778) (tstamp 617c0aac-448c-4e53-89db-c064d51ef7fd))
  (fp_line (start -1.524 -0.889) (end -1.524 0.889) (layer "F.SilkS") (width 0.1778) (tstamp 7f44d176-5d1b-4066-afeb-37b1a4b37a2d))
  (fp_line (start -1.524 0.889) (end -0.508 0.889) (layer "F.SilkS") (width 0.1778) (tstamp 801a82f7-3d4f-4673-9460-88f1123e44f7))
  (fp_line (start -1.524 -0.889) (end -0.508 -0.889) (layer "F.SilkS") (width 0.1778) (tstamp 9d33ebe2-94ff-46c0-8021-2b6ef289e87d))
  (fp_line (start 0.508 0.889) (end 1.524 0.889) (layer "F.SilkS") (width 0.1778) (tstamp c4e8e1d7-db0b-42f4-869f-1a8619764104))
  (fp_rect (start -1.651 -1.016) (end 1.651 1.016) (layer "F.CrtYd") (width 0.0254) (fill none) (tstamp 2fb121d2-db72-47f0-8a96-e5c06a269363))
  (fp_line (start -1.27 -0.625) (end 1.27 -0.625) (layer "F.Fab") (width 0.1) (tstamp 6010d43f-9461-499a-a7b7-7465095f5a7d))
  (fp_line (start 1.27 0.625) (end -1.27 0.625) (layer "F.Fab") (width 0.1) (tstamp 7c3753f8-6046-4444-acb8-4ba86e51d7f1))
  (fp_line (start 1.27 -0.625) (end 1.27 0.625) (layer "F.Fab") (width 0.1) (tstamp c153ae42-2023-42fe-9b4f-7656c8de012d))
  (fp_line (start -1.27 0.625) (end -1.27 -0.625) (layer "F.Fab") (width 0.1) (tstamp eb2a709d-644a-468f-af48-1af8eae29ad0))
  (pad "1" smd rect locked (at -0.889 0) (size 0.889 1.397) (layers "F.Cu" "F.Paste" "F.Mask")
    (solder_mask_margin 0.0762) (tstamp e9b8ddec-f586-405b-905d-71736cae2810))
  (pad "2" smd rect locked (at 0.889 0) (size 0.889 1.397) (layers "F.Cu" "F.Paste" "F.Mask")
    (solder_mask_margin 0.0762) (tstamp b0eeeff6-7015-4223-b0f3-0d6ab63f20dd))
  (model "${KICAD6_3DMODEL_DIR}/Resistor_SMD.3dshapes/R_0805_2012Metric.wrl"
    (offset (xyz 0 0 0))
    (scale (xyz 1 1 1))
    (rotate (xyz 0 0 0))
  )
)
