(footprint "QFN24_4.0x4.0_P0.5_EP2.7x2.7" (version 20211014) (generator pcbnew)
  (layer "F.Cu")
  (tedit 619B9929)
  (attr smd)
  (fp_text reference "REF**" (at 0 -3.75 unlocked) (layer "F.SilkS")
    (effects (font (size 1 1) (thickness 0.15)))
    (tstamp 8090e760-b9d7-4bde-b8e7-2bb8581e9b1d)
  )
  (fp_text value "QFN24_4.0x4.0_P0.5_EP2.7x2.7" (at 0 3.75 unlocked) (layer "F.Fab")
    (effects (font (size 1 1) (thickness 0.15)))
    (tstamp 169b7231-7f3a-4d89-a10a-78575ea77c1b)
  )
  (fp_text user "${REFERENCE}" (at 0 0 unlocked) (layer "F.Fab")
    (effects (font (size 1 1) (thickness 0.15)))
    (tstamp 999bd3a6-d40c-4a17-bf28-9ea2641c7e57)
  )
  (fp_line (start -2 1.6) (end -2 2) (layer "F.SilkS") (width 0.1778) (tstamp 11bbb8d7-3d63-4e44-b84b-e39195d7f80a))
  (fp_line (start -2.4 -1.6) (end -2.4 -2.4) (layer "F.SilkS") (width 0.1778) (tstamp 23c46eb8-9881-409e-8aae-b5900fb4f556))
  (fp_line (start 2 1.6) (end 2 2) (layer "F.SilkS") (width 0.1778) (tstamp 40a88195-d0b0-40a4-9815-44e2f54f450b))
  (fp_line (start -2 -2) (end -1.6 -2) (layer "F.SilkS") (width 0.1778) (tstamp 4ca9bf38-97c0-4d35-8f4d-def1baeef3e5))
  (fp_line (start -2 -1.6) (end -2 -2) (layer "F.SilkS") (width 0.1778) (tstamp 5694fa26-aff3-48a2-aebf-fcd2f6bce83d))
  (fp_line (start -2.4 -2.4) (end -1.6 -2.4) (layer "F.SilkS") (width 0.1778) (tstamp 7724c581-2d9b-4f1a-aad5-5b7bce3ad009))
  (fp_line (start 2 2) (end 1.6 2) (layer "F.SilkS") (width 0.1778) (tstamp dbcaabcc-6783-4a6e-b42e-887601b53c82))
  (fp_line (start 1.6 -2) (end 2 -2) (layer "F.SilkS") (width 0.1778) (tstamp df04bdbc-bf59-4fda-a2aa-bc963c2ae016))
  (fp_line (start -2 2) (end -1.6 2) (layer "F.SilkS") (width 0.1778) (tstamp e3389f11-717a-4f16-b7a4-b183aee15fce))
  (fp_line (start 2 -2) (end 2 -1.6) (layer "F.SilkS") (width 0.1778) (tstamp ec8bdbca-b9a6-47ec-ab47-f3698de7b10a))
  (fp_poly (pts
      (xy -2.75 -1.25)
      (xy -3.25 -0.75)
      (xy -3.25 -1.75)
    ) (layer "F.SilkS") (width 0.12) (fill solid) (tstamp f084dda5-3e88-4657-ac14-f0e7da6e6ee3))
  (fp_rect (start -2.75 -2.75) (end 2.75 2.75) (layer "F.CrtYd") (width 0.0254) (fill none) (tstamp 33b5fd72-423c-4fd1-bfd5-bf4eed57e2a0))
  (fp_line (start -2 -1.5) (end -1.5 -2) (layer "F.Fab") (width 0.1) (tstamp 43d7a452-b2f6-4f46-9b6b-4151c8964bc7))
  (fp_rect (start -2 -2) (end 2 2) (layer "F.Fab") (width 0.1) (fill none) (tstamp de8cd73d-a644-43a4-bceb-8cfcf7d3f93f))
  (pad "1" smd rect (at -2 -1.25) (size 1.016 0.254) (layers "F.Cu" "F.Paste" "F.Mask")
    (solder_mask_margin 0.0762) (tstamp 73db7188-78f0-44ed-b77b-ee1e0d251681))
  (pad "2" smd oval (at -2 -0.75) (size 1.016 0.254) (layers "F.Cu" "F.Paste" "F.Mask")
    (solder_mask_margin 0.0762) (tstamp 6b8029d2-4abd-4105-a87d-263d7f96eafe))
  (pad "3" smd oval (at -2 -0.25) (size 1.016 0.254) (layers "F.Cu" "F.Paste" "F.Mask")
    (solder_mask_margin 0.0762) (tstamp 43e7f740-6c95-4fe4-9106-1719cf3cb612))
  (pad "4" smd oval (at -2 0.25) (size 1.016 0.254) (layers "F.Cu" "F.Paste" "F.Mask")
    (solder_mask_margin 0.0762) (tstamp 53216072-6205-4787-9979-8554826ffd27))
  (pad "5" smd oval (at -2 0.75) (size 1.016 0.254) (layers "F.Cu" "F.Paste" "F.Mask")
    (solder_mask_margin 0.0762) (tstamp 768ea983-23c6-4b74-b321-7ccc18299797))
  (pad "6" smd oval (at -2 1.25) (size 1.016 0.254) (layers "F.Cu" "F.Paste" "F.Mask")
    (solder_mask_margin 0.0762) (tstamp 00cd0611-bddd-4abd-951a-103ddb657602))
  (pad "7" smd oval (at -1.25 2) (size 0.254 1.016) (layers "F.Cu" "F.Paste" "F.Mask")
    (solder_mask_margin 0.0762) (tstamp 79b37e51-d096-4e43-ad3a-0fa8cae067f5))
  (pad "8" smd oval (at -0.75 2) (size 0.254 1.016) (layers "F.Cu" "F.Paste" "F.Mask")
    (solder_mask_margin 0.0762) (tstamp 6535f4c9-808c-4879-8108-75c3b8436769))
  (pad "9" smd oval (at -0.25 2) (size 0.254 1.016) (layers "F.Cu" "F.Paste" "F.Mask")
    (solder_mask_margin 0.0762) (tstamp f3fc9c5d-eacd-44d6-9b85-5aaf376004d5))
  (pad "10" smd oval (at 0.25 2) (size 0.254 1.016) (layers "F.Cu" "F.Paste" "F.Mask")
    (solder_mask_margin 0.0762) (tstamp 07a5afe1-c1c0-4081-ad67-3db41e5ed2c6))
  (pad "11" smd oval (at 0.75 2) (size 0.254 1.016) (layers "F.Cu" "F.Paste" "F.Mask")
    (solder_mask_margin 0.0762) (tstamp 02696c0e-2ddf-430d-8656-b5aee86c778c))
  (pad "12" smd oval (at 1.25 2) (size 0.254 1.016) (layers "F.Cu" "F.Paste" "F.Mask")
    (solder_mask_margin 0.0762) (tstamp df1ab3b0-5527-45e0-b39e-371b337f3ea1))
  (pad "13" smd oval (at 2 1.25) (size 1.016 0.254) (layers "F.Cu" "F.Paste" "F.Mask")
    (solder_mask_margin 0.0762) (tstamp 45cba7ae-8ed6-44d2-a66d-c780a2d62846))
  (pad "14" smd oval (at 2 0.75) (size 1.016 0.254) (layers "F.Cu" "F.Paste" "F.Mask")
    (solder_mask_margin 0.0762) (tstamp e4c59f88-b865-4295-a90e-692debd7015d))
  (pad "15" smd oval (at 2 0.25) (size 1.016 0.254) (layers "F.Cu" "F.Paste" "F.Mask")
    (solder_mask_margin 0.0762) (tstamp dbe0ecbf-9239-44dc-af11-63d6f90378aa))
  (pad "16" smd oval (at 2 -0.25) (size 1.016 0.254) (layers "F.Cu" "F.Paste" "F.Mask")
    (solder_mask_margin 0.0762) (tstamp ca65587c-0134-43a5-95ad-13123587d291))
  (pad "17" smd oval (at 2 -0.75) (size 1.016 0.254) (layers "F.Cu" "F.Paste" "F.Mask")
    (solder_mask_margin 0.0762) (tstamp 4e3cc4a0-9839-471b-88a1-368fca8ec2fa))
  (pad "18" smd oval (at 2 -1.25) (size 1.016 0.254) (layers "F.Cu" "F.Paste" "F.Mask")
    (solder_mask_margin 0.0762) (tstamp 8afaa5a0-f570-41e8-87eb-32b583714df4))
  (pad "19" smd oval (at 1.25 -2) (size 0.254 1.016) (layers "F.Cu" "F.Paste" "F.Mask")
    (solder_mask_margin 0.0762) (tstamp 1ed0b48e-2c8c-4104-ba16-7b2f8af184c4))
  (pad "20" smd oval (at 0.75 -2) (size 0.254 1.016) (layers "F.Cu" "F.Paste" "F.Mask")
    (solder_mask_margin 0.0762) (tstamp 706d522b-b9c0-4b66-b231-688628e87c40))
  (pad "21" smd oval (at 0.25 -2) (size 0.254 1.016) (layers "F.Cu" "F.Paste" "F.Mask")
    (solder_mask_margin 0.0762) (tstamp 6b5c9915-3e6c-40d8-a554-ab9a20218349))
  (pad "22" smd oval (at -0.25 -2) (size 0.254 1.016) (layers "F.Cu" "F.Paste" "F.Mask")
    (solder_mask_margin 0.0762) (tstamp 4ca45b62-9233-4f1d-bc8c-c250628e41ea))
  (pad "23" smd oval (at -0.75 -2) (size 0.254 1.016) (layers "F.Cu" "F.Paste" "F.Mask")
    (solder_mask_margin 0.0762) (tstamp dc0037fa-6069-4eea-ba48-50b896cf4fa8))
  (pad "24" smd oval (at -1.25 -2) (size 0.254 1.016) (layers "F.Cu" "F.Paste" "F.Mask")
    (solder_mask_margin 0.0762) (tstamp a73507b7-63a2-49a2-9257-fa6f69208c69))
  (pad "25" thru_hole circle (at 0.75 0.75) (size 0.762 0.762) (drill 0.508) (layers *.Cu *.Mask) (tstamp 551029f4-fe1a-4243-ad65-a696229de0d9))
  (pad "25" smd rect (at -0.75 -0.75) (size 1.016 1.016) (layers "F.Cu" "F.Paste" "F.Mask")
    (solder_mask_margin 0.0762) (tstamp 56a85ade-8880-4fb8-8664-626b75b1c61f))
  (pad "25" smd rect (at 0.75 0.75) (size 1.016 1.016) (layers "F.Cu" "F.Paste" "F.Mask")
    (solder_mask_margin 0.0762) (tstamp 6558bf02-dc98-4dc5-ae59-746154e57293))
  (pad "25" smd rect (at 0.75 -0.75) (size 1.016 1.016) (layers "F.Cu" "F.Paste" "F.Mask")
    (solder_mask_margin 0.0762) (tstamp 677a94e3-1e98-4a22-bfa7-a7f3b30f6f0c))
  (pad "25" thru_hole circle (at 0.75 -0.75) (size 0.762 0.762) (drill 0.508) (layers *.Cu *.Mask) (tstamp 80ee540d-11fc-44c3-a725-08c7d5dac854))
  (pad "25" thru_hole circle (at -0.75 -0.75) (size 0.762 0.762) (drill 0.508) (layers *.Cu *.Mask) (tstamp 877f10aa-dccf-4897-a500-412be7829c08))
  (pad "25" smd rect (at -0.75 0.75) (size 1.016 1.016) (layers "F.Cu" "F.Paste" "F.Mask")
    (solder_mask_margin 0.0762) (tstamp 8f9ed72d-2499-4b7c-bdf2-f3cf951ab4c2))
  (pad "25" thru_hole circle (at -0.75 0.75) (size 0.762 0.762) (drill 0.508) (layers *.Cu *.Mask) (tstamp b7a7ba1e-78c0-4e13-b500-c3f67ceb189d))
)
