(footprint "B1210" (version 20211014) (generator pcbnew)
  (layer "F.Cu")
  (tedit 61A5978A)
  (descr "Capacitor SMD 1210 (3225 Metric), square (rectangular) end terminal, IPC_7351 nominal, (Body size source: IPC-SM-782 page 76, https://www.pcb-3d.com/wordpress/wp-content/uploads/ipc-sm-782a_amendment_1_and_2.pdf), generated with kicad-footprint-generator")
  (tags "capacitor")
  (attr smd)
  (fp_text reference "REF**" (at 0 -2.413) (layer "F.SilkS")
    (effects (font (size 1.016 1.016) (thickness 0.1778)))
    (tstamp e47cd157-0400-46e7-9ddc-0c53f8a564c5)
  )
  (fp_text value "B1210" (at 0 2.54) (layer "F.Fab")
    (effects (font (size 1.016 1.016) (thickness 0.1778)))
    (tstamp 5d211f59-34ed-4983-be1b-4e0a1d3ffeee)
  )
  (fp_text user "${REFERENCE}" (at 0 0) (layer "F.Fab")
    (effects (font (size 1.016 1.016) (thickness 0.1778)))
    (tstamp a99afcac-cd17-40c5-95a5-13104a5c3136)
  )
  (fp_text user "Dimension: 3.2x2.5mm" (at 0 7.62 unlocked) (layer "User.1")
    (effects (font (size 1.016 1.016) (thickness 0.1778) italic) (justify left))
    (tstamp 17faff6c-d49d-4dea-933a-97c7e4294b2a)
  )
  (fp_text user "Auth: Thanh Duong" (at 0 9.652 unlocked) (layer "User.1")
    (effects (font (size 1.016 1.016) (thickness 0.1778) italic) (justify left))
    (tstamp af7c055f-68f9-4aa0-a24b-65e0c3ac4f8a)
  )
  (fp_text user "Footprint: 1210 (3225 Metric)" (at 0 5.588 unlocked) (layer "User.1")
    (effects (font (size 1.016 1.016) (thickness 0.1778) italic) (justify left))
    (tstamp b73660f1-5249-4b4c-a8cb-e78df70ae4a2)
  )
  (fp_line (start 2.159 1.27) (end 2.159 -1.27) (layer "F.SilkS") (width 0.1778) (tstamp 009cc7c4-2070-4260-8095-fb912df88e6f))
  (fp_line (start -1.905 1.523997) (end -0.889 1.524) (layer "F.SilkS") (width 0.1778) (tstamp 05b185c3-ec37-4c1d-b791-992b66ba0ac3))
  (fp_line (start -2.159 1.27) (end -2.159 -1.27) (layer "F.SilkS") (width 0.1778) (tstamp 14ca3579-646d-45ed-9754-70265d3b8b05))
  (fp_line (start 0.889 -1.524) (end 1.905 -1.523997) (layer "F.SilkS") (width 0.1778) (tstamp 1e319bec-4915-4188-8b00-b00abfe6be4a))
  (fp_line (start 1.905 -1.524002) (end 2.159 -1.27) (layer "F.SilkS") (width 0.1778) (tstamp 3622d517-668d-4db5-abdf-486495e6594a))
  (fp_line (start -1.905 -1.523999) (end -0.889 -1.524) (layer "F.SilkS") (width 0.1778) (tstamp 6147d4b4-88bd-4fcd-9975-9a60c11c33f5))
  (fp_line (start 0.889 1.524) (end 1.905 1.523997) (layer "F.SilkS") (width 0.1778) (tstamp 98026164-f57c-4efa-b1f8-baf2985817cc))
  (fp_line (start 1.905 1.523997) (end 2.159 1.269999) (layer "F.SilkS") (width 0.1778) (tstamp c51181ec-d923-4afd-862f-45cdd2d0f2c7))
  (fp_line (start -1.905 1.523997) (end -2.159 1.269995) (layer "F.SilkS") (width 0.1778) (tstamp d10d29dc-745b-4e63-ac6f-88f175e99a1f))
  (fp_line (start -2.159 -1.27) (end -1.905 -1.523998) (layer "F.SilkS") (width 0.1778) (tstamp f95e8667-a3b3-4c6a-8195-7aaed2ba4086))
  (fp_rect (start -2.159 -1.524) (end 2.159 1.651) (layer "F.CrtYd") (width 0.0254) (fill none) (tstamp 5f50a8e7-8c27-4037-b694-20faf87bb7d3))
  (fp_rect (start -1.6 -1.25) (end 1.6 1.25) (layer "F.Fab") (width 0.1) (fill none) (tstamp c261ca75-4c84-4b32-9c8e-81722fe5118d))
  (pad "1" smd rect (at -1.397 0) (size 1.143 2.667) (layers "F.Cu" "F.Paste" "F.Mask")
    (solder_mask_margin 0.0762) (tstamp b0d0ecf0-692a-49d7-9ddc-e9bc0cda6cd7))
  (pad "2" smd rect (at 1.397 0) (size 1.143 2.667) (layers "F.Cu" "F.Paste" "F.Mask")
    (solder_mask_margin 0.0762) (tstamp 70d92886-f588-47ec-8424-33f9345c1b31))
  (model "${KICAD6_3DMODEL_DIR}/Inductor_SMD.3dshapes/L_1210_3225Metric.step"
    (offset (xyz 0 0 0))
    (scale (xyz 1 1 1))
    (rotate (xyz 0 0 0))
  )
)
