(footprint "Crystal_SMD_3225-4Pin" (version 20210722) (generator pcbnew) (layer "F.Cu")
  (tedit 617556F9)
  (descr "SMD Crystal SERIES SMD3225/4 http://www.txccrystal.com/images/pdf/7m-accuracy.pdf, 3.2x2.5mm^2 package")
  (tags "SMD SMT crystal")
  (attr smd)
  (fp_text reference "REF**" (at 0 -2.45) (layer "F.SilkS")
    (effects (font (size 1 1) (thickness 0.15)))
    (tstamp bdfc5963-c803-45aa-a85e-4531b9b629cb)
  )
  (fp_text value "Crystal_SMD_3225-4Pin" (at 0 2.45) (layer "F.Fab")
    (effects (font (size 1 1) (thickness 0.15)))
    (tstamp aefe8508-d025-4299-b638-0e409ea19ef8)
  )
  (fp_text user "${REFERENCE}" (at 0 0) (layer "F.Fab")
    (effects (font (size 0.7 0.7) (thickness 0.105)))
    (tstamp d3e6a645-4a3a-4d4b-9157-1410b71c696f)
  )
  (fp_line (start -2.286 2.032) (end -1.524 2.032) (layer "F.SilkS") (width 0.1778) (tstamp 0040358a-2369-4745-a04e-a69cd33059c1))
  (fp_line (start -2.286 1.27) (end -2.286 2.032) (layer "F.SilkS") (width 0.1778) (tstamp 4cfee980-9899-4968-8080-4cfb9aa98880))
  (fp_rect (start -2.032 -1.778) (end 2.032 1.778) (layer "F.SilkS") (width 0.1778) (fill none) (tstamp 7cbcd534-33fc-472f-a514-0fbbcb403f87))
  (fp_rect (start -2.032 -1.778) (end 2.032 1.778) (layer "F.CrtYd") (width 0.0254) (fill none) (tstamp af898a8a-e992-4ec6-b9f8-27a113c3dbf9))
  (fp_line (start -1.6 -1.25) (end -1.6 1.25) (layer "F.Fab") (width 0.1) (tstamp 235806e8-4fa5-4b01-8a70-62a5d05a870a))
  (fp_line (start -1.6 0.25) (end -0.6 1.25) (layer "F.Fab") (width 0.1) (tstamp 2d8dd5b1-74dc-406b-8faa-326b0d87041c))
  (fp_line (start 1.6 -1.25) (end -1.6 -1.25) (layer "F.Fab") (width 0.1) (tstamp 4260e9be-80ff-4642-87d9-b5ecdd1bf848))
  (fp_line (start 1.6 1.25) (end 1.6 -1.25) (layer "F.Fab") (width 0.1) (tstamp 6cf3d7ad-f9d0-4bdb-afd0-a7569b8bd9e4))
  (fp_line (start -1.6 1.25) (end 1.6 1.25) (layer "F.Fab") (width 0.1) (tstamp fda6fac8-8d4a-4b80-982a-29cd940c421f))
  (pad "1" smd rect locked (at -1.1 0.85) (size 1.4 1.2) (layers "F.Cu" "F.Paste" "F.Mask")
    (solder_mask_margin 0.0762) (tstamp ad6a0644-0c23-49bc-b5a9-339b07f8f84e))
  (pad "2" smd rect locked (at 1.1 0.85) (size 1.4 1.2) (layers "F.Cu" "F.Paste" "F.Mask")
    (solder_mask_margin 0.0762) (tstamp 3fdaa614-5c98-4871-8687-6cee0c246fd1))
  (pad "3" smd rect locked (at 1.1 -0.85) (size 1.4 1.2) (layers "F.Cu" "F.Paste" "F.Mask")
    (solder_mask_margin 0.0762) (tstamp 01f85a32-a0e0-46de-9f5f-33d3cc996310))
  (pad "4" smd rect locked (at -1.1 -0.85) (size 1.4 1.2) (layers "F.Cu" "F.Paste" "F.Mask")
    (solder_mask_margin 0.0762) (tstamp 4e931f72-042c-4ef0-b0c1-f6bdb09a8f4c))
  (model "${KICAD6_3DMODEL_DIR}/Crystal.3dshapes/Crystal_SMD_3225-4Pin_3.2x2.5mm.wrl"
    (offset (xyz 0 0 0))
    (scale (xyz 1 1 1))
    (rotate (xyz 0 0 0))
  )
)
