(footprint "HDR_P2.54_1x11_RA" (version 20210722) (generator pcbnew) (layer "F.Cu")
  (tedit 6176BD7A)
  (descr "Through hole angled pin header, 1x10, 2.54mm pitch, 6mm pin length, single row")
  (tags "Through hole angled pin header THT 1x10 2.54mm single row")
  (attr through_hole)
  (fp_text reference "REF**" (at 0 0 90) (layer "F.SilkS")
    (effects (font (size 1.016 1.016) (thickness 0.1778)))
    (tstamp a3f9999e-ed41-4c50-a5f9-dfd074cc08ae)
  )
  (fp_text value "HDR_P2.54_1x11_RA" (at 2.794 0 90) (layer "F.Fab")
    (effects (font (size 1 1) (thickness 0.15)))
    (tstamp 2ea14660-0900-40e0-8c6c-b7523210d993)
  )
  (fp_text user "${REFERENCE}" (at 2.794 -0.066 90) (layer "F.Fab")
    (effects (font (size 1 1) (thickness 0.15)))
    (tstamp 7ea31d77-c388-4752-9051-afed4d6b6f34)
  )
  (fp_line (start 1.016 -2.286) (end 1.524 -2.286) (layer "F.SilkS") (width 0.1778) (tstamp 03340fba-cdb4-4368-87b8-6198f7f85aa8))
  (fp_line (start 1.016 2.286) (end 1.524 2.286) (layer "F.SilkS") (width 0.1778) (tstamp 0b0b13f9-3582-4e14-a6fc-ac81cfbf4c9c))
  (fp_line (start 1.016 -12.954) (end 1.524 -12.954) (layer "F.SilkS") (width 0.1778) (tstamp 209aeecd-fbf2-49ff-9ad4-6e7db87b5c37))
  (fp_line (start -1.27 -12.7) (end -1.27 -13.97) (layer "F.SilkS") (width 0.1778) (tstamp 2173a589-0963-44fb-9593-ef45e02e753b))
  (fp_line (start 1.016 -7.366) (end 1.524 -7.366) (layer "F.SilkS") (width 0.1778) (tstamp 3e86eeb3-4208-4267-9918-c9afbfdb01ee))
  (fp_line (start 1.016 7.874) (end 1.524 7.874) (layer "F.SilkS") (width 0.1778) (tstamp 4547ad6e-0b71-46ab-aed4-708012e713c6))
  (fp_line (start 1.016 9.906) (end 1.524 9.906) (layer "F.SilkS") (width 0.1778) (tstamp 45a1d5df-beac-4e5a-b9ec-c59b406bf216))
  (fp_line (start 1.016 12.446) (end 1.524 12.446) (layer "F.SilkS") (width 0.1778) (tstamp 49de40e5-1535-4bea-8669-e8a4a020fe2b))
  (fp_line (start 1.016 -5.334) (end 1.524 -5.334) (layer "F.SilkS") (width 0.1778) (tstamp 4f75ef78-08ca-4d4e-a55a-540162ee80d2))
  (fp_line (start -1.27 -13.97) (end 0 -13.97) (layer "F.SilkS") (width 0.1778) (tstamp 878e2bc4-19e0-4572-a1e0-c14acfa63feb))
  (fp_line (start 1.016 0.254) (end 1.524 0.254) (layer "F.SilkS") (width 0.1778) (tstamp 88dbcbcf-725a-47d1-8239-12259a264efb))
  (fp_line (start 1.016 -0.254) (end 1.524 -0.254) (layer "F.SilkS") (width 0.1778) (tstamp 9380f8ce-19d2-4b90-90bf-683a59e7204c))
  (fp_line (start 1.016 7.366) (end 1.524 7.366) (layer "F.SilkS") (width 0.1778) (tstamp 99137dbf-8413-438b-99c6-e355a6b1d256))
  (fp_line (start 1.016 -2.794) (end 1.524 -2.794) (layer "F.SilkS") (width 0.1778) (tstamp 9d964724-08ad-4536-87e4-7b48f4e4c17d))
  (fp_line (start 1.016 -9.906) (end 1.524 -9.906) (layer "F.SilkS") (width 0.1778) (tstamp a0e63a17-dd6a-44b5-821d-8a61c6d4fa25))
  (fp_line (start 1.016 2.794) (end 1.524 2.794) (layer "F.SilkS") (width 0.1778) (tstamp a697b2e4-ef11-4d31-9367-f128cd246ebd))
  (fp_line (start 1.016 5.334) (end 1.524 5.334) (layer "F.SilkS") (width 0.1778) (tstamp a7235102-9243-48cc-961a-1dcd2dcd0bcd))
  (fp_line (start 1.016 12.954) (end 1.524 12.954) (layer "F.SilkS") (width 0.1778) (tstamp a94092da-d429-46d4-b42a-b9c768e92c34))
  (fp_line (start 1.016 -4.826) (end 1.524 -4.826) (layer "F.SilkS") (width 0.1778) (tstamp b2699252-6da5-4073-aab4-ce25bc37dad5))
  (fp_line (start 1.016 -10.414) (end 1.524 -10.414) (layer "F.SilkS") (width 0.1778) (tstamp b7e3f921-230a-4a86-94b4-c66b9a938492))
  (fp_line (start 1.016 10.414) (end 1.524 10.414) (layer "F.SilkS") (width 0.1778) (tstamp c505ae8e-b6d9-4919-bf35-6259343131e4))
  (fp_line (start 1.016 4.826) (end 1.524 4.826) (layer "F.SilkS") (width 0.1778) (tstamp d0591627-79ba-4595-82b9-771fc4e135c0))
  (fp_line (start 1.016 -12.446) (end 1.524 -12.446) (layer "F.SilkS") (width 0.1778) (tstamp ef84a815-fbed-460e-ad54-ebf5a7f41591))
  (fp_line (start 1.016 -7.874) (end 1.524 -7.874) (layer "F.SilkS") (width 0.1778) (tstamp f13ad19d-ee20-4aab-8060-02de444818b9))
  (fp_rect (start 4.064 12.446) (end 10.16 12.954) (layer "F.SilkS") (width 0.1778) (fill none) (tstamp 09f0ebd0-c5d4-490e-bf30-4696275fb099))
  (fp_rect (start 1.524 11.43) (end 4.064 8.89) (layer "F.SilkS") (width 0.1778) (fill none) (tstamp 09fd9994-5bc8-4e04-be36-4bc4b8c188f6))
  (fp_rect (start 1.524 13.97) (end 4.064 11.43) (layer "F.SilkS") (width 0.1778) (fill none) (tstamp 0b91b0f3-ec8c-4152-8f97-3ba2e474a282))
  (fp_rect (start 1.524 1.27) (end 4.064 -1.27) (layer "F.SilkS") (width 0.1778) (fill none) (tstamp 3f71490e-82e2-4a84-a11e-f8de16e750c9))
  (fp_rect (start 1.524 -11.43) (end 4.064 -13.97) (layer "F.SilkS") (width 0.1778) (fill none) (tstamp 41ff1e78-898a-4bc8-987b-1ca9d21a4652))
  (fp_rect (start 1.524 -8.89) (end 4.064 -11.43) (layer "F.SilkS") (width 0.1778) (fill none) (tstamp 437764b7-cfb3-4e5c-bc01-c12b5f78b707))
  (fp_rect (start 4.064 -2.794) (end 10.16 -2.286) (layer "F.SilkS") (width 0.1778) (fill none) (tstamp 4c123da5-420c-4d10-83c4-c7f2c11191de))
  (fp_rect (start 4.064 -7.874) (end 10.16 -7.366) (layer "F.SilkS") (width 0.1778) (fill none) (tstamp 4cdb41cb-0e0f-4b1b-813e-cc8cb36bba97))
  (fp_rect (start 4.064 4.826) (end 10.16 5.334) (layer "F.SilkS") (width 0.1778) (fill none) (tstamp 5b47bfbf-9cc1-4e1e-91b0-10905e3ee70c))
  (fp_rect (start 4.064 9.906) (end 10.16 10.414) (layer "F.SilkS") (width 0.1778) (fill none) (tstamp 5ff31ef9-4c11-49ff-9806-a8c241e08914))
  (fp_rect (start 4.064 7.366) (end 10.16 7.874) (layer "F.SilkS") (width 0.1778) (fill none) (tstamp 6d4337b3-c724-4365-9473-06d12fdf0a99))
  (fp_rect (start 4.064 2.286) (end 10.16 2.794) (layer "F.SilkS") (width 0.1778) (fill none) (tstamp 7d586ca3-5e59-49b5-b8a5-4b99e392da4c))
  (fp_rect (start 1.524 3.81) (end 4.064 1.27) (layer "F.SilkS") (width 0.1778) (fill none) (tstamp 818bd91a-770b-483b-b9e3-5ee275ac5aae))
  (fp_rect (start 4.064 -12.954) (end 10.16 -12.446) (layer "F.SilkS") (width 0.1778) (fill solid) (tstamp 8e0748dc-a736-4065-b2c7-f094b606a48b))
  (fp_rect (start 4.064 -0.254) (end 10.16 0.254) (layer "F.SilkS") (width 0.1778) (fill none) (tstamp 90a8fd74-aa42-4537-8fb9-20cb267528b3))
  (fp_rect (start 4.064 -5.334) (end 10.16 -4.826) (layer "F.SilkS") (width 0.1778) (fill none) (tstamp c9275111-73c6-4b05-b5c9-e8bdb145ecf7))
  (fp_rect (start 1.524 -6.35) (end 4.064 -8.89) (layer "F.SilkS") (width 0.1778) (fill none) (tstamp cf77df64-2058-4bf8-93a2-d392de814cea))
  (fp_rect (start 4.064 -10.414) (end 10.16 -9.906) (layer "F.SilkS") (width 0.1778) (fill none) (tstamp d659e06d-9570-4052-9862-5b85ee879801))
  (fp_rect (start 1.524 -3.81) (end 4.064 -6.35) (layer "F.SilkS") (width 0.1778) (fill none) (tstamp e75f84b7-5b09-4106-a233-d190d1c572b4))
  (fp_rect (start 1.524 6.35) (end 4.064 3.81) (layer "F.SilkS") (width 0.1778) (fill none) (tstamp e784d58e-a6a6-4a33-8d48-b5993033501d))
  (fp_rect (start 1.524 -1.27) (end 4.064 -3.81) (layer "F.SilkS") (width 0.1778) (fill none) (tstamp f9a45678-51f7-4948-a459-3d76f6176c74))
  (fp_rect (start 1.524 8.89) (end 4.064 6.35) (layer "F.SilkS") (width 0.1778) (fill none) (tstamp fff084de-466e-461f-9652-6900166b90fb))
  (fp_rect (start -1.778 -14.478) (end 10.668 14.478) (layer "F.CrtYd") (width 0.0254) (fill none) (tstamp e0e6ba13-e79f-4a8d-a4d9-6a948ba1e9a7))
  (fp_line (start 4.064 13.97) (end 1.524 13.97) (layer "F.Fab") (width 0.1) (tstamp 0072b458-3db0-4a4d-9fca-d1b375524e78))
  (fp_line (start 1.524 -13.462) (end 2.032 -13.97) (layer "F.Fab") (width 0.1) (tstamp 2519a6f3-cb84-4254-84cb-d467d35fc672))
  (fp_line (start 2.032 -13.97) (end 4.064 -13.97) (layer "F.Fab") (width 0.1) (tstamp 4da9c602-3255-4037-8645-d84e62d2b0a8))
  (fp_line (start 4.064 -13.97) (end 4.064 13.97) (layer "F.Fab") (width 0.1) (tstamp d75701d0-76a2-4855-aa0f-bfeec9b9a61d))
  (fp_line (start 1.524 13.97) (end 1.524 -13.462) (layer "F.Fab") (width 0.1) (tstamp fa1723f0-eeb6-4569-833f-2d02c9c5234d))
  (fp_rect (start -0.254 -12.954) (end 1.524 -12.446) (layer "F.Fab") (width 0.1) (fill none) (tstamp 0658b237-d400-45ae-bf0f-e9169f2bdfb1))
  (fp_rect (start -0.254 4.826) (end 1.524 5.334) (layer "F.Fab") (width 0.1) (fill none) (tstamp 0aa17188-f92a-41a5-b841-71234b57a191))
  (fp_rect (start 4.064 -0.254) (end 10.16 0.254) (layer "F.Fab") (width 0.1) (fill none) (tstamp 1e29043f-b513-4fd7-9ca7-dfd6a3e26572))
  (fp_rect (start -0.254 -5.334) (end 1.524 -4.826) (layer "F.Fab") (width 0.1) (fill none) (tstamp 256cc83d-24f6-4883-ade0-c5c9cada1d7f))
  (fp_rect (start 4.064 7.874) (end 10.16 7.366) (layer "F.Fab") (width 0.1) (fill none) (tstamp 43202f2b-a20b-47ce-8296-ec8da5f34a61))
  (fp_rect (start 4.064 -2.794) (end 10.16 -2.286) (layer "F.Fab") (width 0.1) (fill none) (tstamp 52c171fb-2a5c-4240-b110-0aeba79ce11a))
  (fp_rect (start -0.254 0.254) (end 1.524 -0.254) (layer "F.Fab") (width 0.1) (fill none) (tstamp 62ba922e-337e-42f0-bf6b-b0a3cb203fd5))
  (fp_rect (start -0.254 9.906) (end 1.524 10.414) (layer "F.Fab") (width 0.1) (fill none) (tstamp 64bb4434-4c6d-4f3b-924f-635fda325214))
  (fp_rect (start 4.064 -12.954) (end 10.16 -12.446) (layer "F.Fab") (width 0.1) (fill none) (tstamp 6865914b-f83c-47c0-80c2-74e800da1124))
  (fp_rect (start 4.064 5.334) (end 10.16 4.826) (layer "F.Fab") (width 0.1) (fill none) (tstamp 6a40e9d1-8318-460c-9f4a-9a642362d0e8))
  (fp_rect (start -0.254 12.446) (end 1.524 12.954) (layer "F.Fab") (width 0.1) (fill none) (tstamp 73ab5981-fcef-4cf2-9f8c-fcbac179aa71))
  (fp_rect (start -0.254 2.286) (end 1.524 2.794) (layer "F.Fab") (width 0.1) (fill none) (tstamp 8f787d9a-46a0-4e9b-a334-15e0e82b3130))
  (fp_rect (start 4.064 2.286) (end 10.16 2.794) (layer "F.Fab") (width 0.1) (fill none) (tstamp a3af267e-bbb0-43a6-8957-e473b8f6521b))
  (fp_rect (start -0.254 7.366) (end 1.524 7.874) (layer "F.Fab") (width 0.1) (fill none) (tstamp a72c094c-7003-477e-90a1-9882be7ee1e5))
  (fp_rect (start 4.064 -5.334) (end 10.16 -4.826) (layer "F.Fab") (width 0.1) (fill none) (tstamp b60372a9-3c56-4223-a0de-4bd3790e5b85))
  (fp_rect (start 4.064 12.446) (end 10.16 12.954) (layer "F.Fab") (width 0.1) (fill none) (tstamp b8344037-de62-4f18-81f3-cbbab2cbdb90))
  (fp_rect (start -0.254 -7.874) (end 1.524 -7.366) (layer "F.Fab") (width 0.1) (fill none) (tstamp c08c3e11-ac1a-46fa-8b94-aca9f9fe3661))
  (fp_rect (start -0.254 -10.414) (end 1.524 -9.906) (layer "F.Fab") (width 0.1) (fill none) (tstamp cc80da52-153b-483a-a6b3-f16d5cc37514))
  (fp_rect (start 4.064 9.906) (end 10.16 10.414) (layer "F.Fab") (width 0.1) (fill none) (tstamp d2ca807b-ae53-42f8-bdc8-4fc472026508))
  (fp_rect (start -0.254 -2.794) (end 1.524 -2.286) (layer "F.Fab") (width 0.1) (fill none) (tstamp d4e633eb-eab2-40d8-b219-6b0bf641603e))
  (fp_rect (start 4.064 -10.414) (end 10.16 -9.906) (layer "F.Fab") (width 0.1) (fill none) (tstamp d9bf3388-3e0f-4acc-b95e-f92523aede96))
  (fp_rect (start 4.064 -7.874) (end 10.16 -7.366) (layer "F.Fab") (width 0.1) (fill none) (tstamp ff8d0bad-b10d-4b7f-a9c0-3b3afafd70be))
  (pad "1" thru_hole roundrect locked (at 0 -12.7) (size 2.032 1.778) (drill 1.016) (layers *.Cu *.Mask) (roundrect_rratio 0.1) (tstamp 4c9048ad-e4c2-4477-b42f-f9b4286a8408))
  (pad "2" thru_hole oval locked (at 0 -10.16) (size 2.032 1.778) (drill 1.016) (layers *.Cu *.Mask) (tstamp 3d97592d-3db7-4483-894e-cc3e7735527b))
  (pad "3" thru_hole oval locked (at 0 -7.62) (size 2.032 1.778) (drill 1.016) (layers *.Cu *.Mask) (tstamp 08e31fea-002e-4d07-a9a7-7444246350e3))
  (pad "4" thru_hole oval (at 0 -5.08) (size 2.032 1.778) (drill 1.016) (layers *.Cu *.Mask) (tstamp ea4262ba-1c92-45c2-9753-b575b25c99ae))
  (pad "5" thru_hole oval (at 0 -2.54) (size 2.032 1.778) (drill 1.016) (layers *.Cu *.Mask) (tstamp 81755d4c-85b6-45fb-b891-764ddbad7f63))
  (pad "6" thru_hole oval (at 0 0) (size 2.032 1.778) (drill 1.016) (layers *.Cu *.Mask) (tstamp 12116d50-9ed6-4ea2-8afd-8ecd6579ea90))
  (pad "7" thru_hole oval (at 0 2.54) (size 2.032 1.778) (drill 1.016) (layers *.Cu *.Mask) (tstamp ee9ef306-3b38-4381-b63e-bac84593ab0b))
  (pad "8" thru_hole oval (at 0 5.08) (size 2.032 1.778) (drill 1.016) (layers *.Cu *.Mask) (tstamp 45e1edaf-d5ad-4232-83ff-bf4be0977506))
  (pad "9" thru_hole oval (at 0 7.62) (size 2.032 1.778) (drill 1.016) (layers *.Cu *.Mask) (tstamp 618bc073-c6ae-4477-b373-49dbdcadc277))
  (pad "10" thru_hole oval (at 0 10.16) (size 2.032 1.778) (drill 1.016) (layers *.Cu *.Mask) (tstamp 073efe4c-bc52-49e9-8a33-a2cf5870085b))
  (pad "11" thru_hole oval (at 0 12.7) (size 2.032 1.778) (drill 1.016) (layers *.Cu *.Mask) (tstamp 7f1abfdc-5097-4efb-a9d9-09347971120d))
  (model "${KICAD6_3DMODEL_DIR}/Connector_PinHeader_2.54mm.3dshapes/PinHeader_1x11_P2.54mm_Horizontal.wrl"
    (offset (xyz 0 12.7 0))
    (scale (xyz 1 1 1))
    (rotate (xyz 0 0 0))
  )
)
