(footprint "PH_P2.0_7" (version 20210722) (generator pcbnew) (layer "F.Cu")
  (tedit 6176BF92)
  (descr "JST PH series connector, B16B-PH-K (http://www.jst-mfg.com/product/pdf/eng/ePH.pdf), generated with kicad-footprint-generator")
  (tags "connector JST PH side entry")
  (fp_text reference "REF**" (at 0 0) (layer "F.SilkS")
    (effects (font (size 1 1) (thickness 0.15)))
    (tstamp 2890193b-b167-4901-9989-80f30afbc088)
  )
  (fp_text value "PH_P2.0_7" (at 0 0) (layer "F.Fab")
    (effects (font (size 1 1) (thickness 0.15)))
    (tstamp 5b103357-b40b-4f3b-b8b1-78013b29b1db)
  )
  (fp_text user "${REFERENCE}" (at 0 0) (layer "F.Fab")
    (effects (font (size 1 1) (thickness 0.15)))
    (tstamp 48f7553e-d4ea-4e31-bd7a-7ce0c591e409)
  )
  (fp_line (start -7.62 0.762) (end -7.62 2.54) (layer "F.SilkS") (width 0.1778) (tstamp 005922b0-8c49-40fd-a485-f8435c7a7646))
  (fp_line (start 5.588 -1.27) (end 7.62 -1.27) (layer "F.SilkS") (width 0.1778) (tstamp 1cd64941-8143-437c-bc37-2681f935c1bd))
  (fp_line (start 7.62 2.54) (end -7.62 2.54) (layer "F.SilkS") (width 0.1778) (tstamp 40754464-2072-47f6-8fd2-5aede9070b9a))
  (fp_line (start -8.382 -2.032) (end -8.382 -0.762) (layer "F.SilkS") (width 0.1778) (tstamp 5ff8d06a-1c51-4f2c-a94d-f4151ee0a14c))
  (fp_line (start 5.588 -1.778) (end 5.588 -1.27) (layer "F.SilkS") (width 0.1778) (tstamp 746af62b-f9bd-456d-8105-99e46b4e44da))
  (fp_line (start 7.62 -1.27) (end 7.62 -0.508) (layer "F.SilkS") (width 0.1778) (tstamp 78c444a1-f3f1-4500-bf91-81102dc9e73b))
  (fp_line (start -8.382 -2.032) (end -7.112 -2.032) (layer "F.SilkS") (width 0.1778) (tstamp ab17b804-0a71-4f56-b2ac-672f06c718ea))
  (fp_line (start -5.588 -1.27) (end -7.62 -1.27) (layer "F.SilkS") (width 0.1778) (tstamp d1941a52-8da7-4e94-9b08-425c54b84aee))
  (fp_line (start -7.62 -1.27) (end -7.62 -0.508) (layer "F.SilkS") (width 0.1778) (tstamp d643c8e0-5f29-413a-88a6-a9547733fa64))
  (fp_line (start -5.588 -1.778) (end -5.588 -1.27) (layer "F.SilkS") (width 0.1778) (tstamp f3f60a06-b1d6-45f9-9e3e-720b972a6e31))
  (fp_line (start 7.62 0.762) (end 7.62 2.54) (layer "F.SilkS") (width 0.1778) (tstamp f47b1532-7abe-4973-ab3b-5870c2506a87))
  (fp_rect (start -8.128 -1.778) (end 8.128 3.048) (layer "F.SilkS") (width 0.1778) (fill none) (tstamp 2624b0d1-b81c-4297-8379-67f5b4b5861f))
  (fp_rect (start -5.05 2.25) (end -4.95 2.504) (layer "F.SilkS") (width 0.1778) (fill none) (tstamp 84bd8244-28ee-4c40-b0ad-5809d8a86c3b))
  (fp_rect (start 4.95 2.25) (end 5.05 2.504) (layer "F.SilkS") (width 0.1778) (fill none) (tstamp abcdd919-f5e1-4e3d-a964-a03803ab2b17))
  (fp_rect (start -1.05 2.25) (end -0.95 2.504) (layer "F.SilkS") (width 0.1778) (fill none) (tstamp b88d041e-b2b7-4bbc-b608-3184d9cd85b1))
  (fp_rect (start 7.62 -0.508) (end 8.128 0.762) (layer "F.SilkS") (width 0.1778) (fill none) (tstamp c2e2cc2e-031d-45c0-9c9d-1d41a68b1d46))
  (fp_rect (start -3.05 2.25) (end -2.95 2.504) (layer "F.SilkS") (width 0.1778) (fill none) (tstamp e0af7b69-a009-4f4f-b3de-7f05719fbdee))
  (fp_rect (start 2.95 2.246) (end 3.05 2.5) (layer "F.SilkS") (width 0.1778) (fill none) (tstamp e973288e-3e54-4b55-ad58-7aed5304d92a))
  (fp_rect (start 0.95 2.25) (end 1.05 2.504) (layer "F.SilkS") (width 0.1778) (fill none) (tstamp eb6cfdc9-c168-4040-8df0-716f6427677d))
  (fp_rect (start -8.128 -0.508) (end -7.62 0.762) (layer "F.SilkS") (width 0.1778) (fill none) (tstamp f72ff592-41ec-421a-8f26-dded17405fa4))
  (fp_rect (start -8.636 -2.286) (end 8.636 3.556) (layer "F.CrtYd") (width 0.0254) (fill none) (tstamp 22112288-7f35-40cf-bef0-bf4362dcadd4))
  (fp_line (start -6.604 -1.524) (end -7.874 -1.524) (layer "F.Fab") (width 0.1) (tstamp 09b10793-43dc-4016-b0cd-5ce910977ec6))
  (fp_line (start -7.874 -1.524) (end -7.874 -0.254) (layer "F.Fab") (width 0.1) (tstamp b05c56ba-81a3-4ab2-ab05-008cce59ad71))
  (fp_rect (start -8.128 -1.778) (end 8.128 3.048) (layer "F.Fab") (width 0.1) (fill none) (tstamp efc078da-68a3-449e-a27f-88fef87ab4a4))
  (pad "1" thru_hole roundrect (at -6 0) (size 1.27 1.778) (drill 0.762) (layers *.Cu *.Mask) (roundrect_rratio 0.2) (tstamp 520ddedd-5b47-44d4-9b39-115487fe061b))
  (pad "2" thru_hole oval (at -4 0) (size 1.27 1.778) (drill 0.762) (layers *.Cu *.Mask) (tstamp 5e4a6a4a-98aa-4029-a2ce-8c66d66d2715))
  (pad "3" thru_hole oval (at -2 0) (size 1.27 1.778) (drill 0.762) (layers *.Cu *.Mask) (tstamp 64b9ab26-0997-4789-a16b-733dd8880e56))
  (pad "4" thru_hole oval (at 0 0) (size 1.27 1.778) (drill 0.762) (layers *.Cu *.Mask) (tstamp 50a70173-c4a7-4799-b106-7c97137b2cae))
  (pad "5" thru_hole oval (at 2 0) (size 1.27 1.778) (drill 0.762) (layers *.Cu *.Mask) (tstamp 6ef3f17e-3f7c-40ec-8cfc-2a21f2c55f1a))
  (pad "6" thru_hole oval (at 4 0) (size 1.27 1.778) (drill 0.762) (layers *.Cu *.Mask) (tstamp 925a8c00-27ac-483a-b64f-c99e7a3b26a7))
  (pad "7" thru_hole oval (at 6 0) (size 1.27 1.778) (drill 0.762) (layers *.Cu *.Mask) (tstamp 71682169-aa69-4520-b6dd-3dcfb7a95298))
  (model "${KICAD6_3DMODEL_DIR}/Connector_JST.3dshapes/JST_PH_B7B-PH-K_1x07_P2.00mm_Vertical.wrl"
    (offset (xyz -6 0 0))
    (scale (xyz 1 1 1))
    (rotate (xyz 0 0 0))
  )
)
