(footprint "LFBGA354_16.0x16.0_P0.8" (version 20211014) (generator pcbnew)
  (layer "F.Cu")
  (tedit 0)
  (attr smd)
  (fp_text reference "REF**" (at 0 -8.89 unlocked) (layer "F.SilkS")
    (effects (font (size 1 1) (thickness 0.15)))
    (tstamp d96a9163-7f41-44ef-bd9c-ff946a22aba4)
  )
  (fp_text value "LFBGA354_16.0x16.0_P0.8" (at 0 8.89 unlocked) (layer "F.Fab")
    (effects (font (size 1 1) (thickness 0.15)))
    (tstamp 8a14508c-3a8f-4197-823b-b1792f918fd4)
  )
  (fp_text user "${REFERENCE}" (at 0 0 unlocked) (layer "F.Fab")
    (effects (font (size 1 1) (thickness 0.15)))
    (tstamp 3ba387f7-d54f-4e95-ac27-a1fe5a11a714)
  )
  (fp_line (start -8.255 -8.255) (end -8.001 -8.255) (layer "F.SilkS") (width 0.1778) (tstamp 472e69ca-0c97-4756-b900-dec32bcf1f79))
  (fp_line (start -8.001 -8.255) (end -7.747 -8.255) (layer "F.SilkS") (width 0.1778) (tstamp 64d56813-c048-48ef-9ad4-8a7f5a9e2263))
  (fp_line (start -7.747 -8.255) (end -7.493 -8.255) (layer "F.SilkS") (width 0.1778) (tstamp 90c73c22-bdc7-4175-9997-2c334f3ebd4b))
  (fp_line (start -8.255 -8.255) (end -8.255 -7.493) (layer "F.SilkS") (width 0.1778) (tstamp cc3b3ca3-5e95-4a70-8416-26148add4b37))
  (fp_rect (start -8.001 -8.001) (end 8.001 8.001) (layer "F.SilkS") (width 0.1778) (fill none) (tstamp ce833b34-4042-4b00-ac1d-4d85ce852e6f))
  (fp_poly (pts
      (xy -8.001 -7.366)
      (xy -8.001 -8.001)
      (xy -7.366 -8.001)
    ) (layer "F.SilkS") (width 0.12) (fill solid) (tstamp af7866c5-2111-4663-b2af-f802912d18a5))
  (fp_rect (start -8 -8) (end 8 8) (layer "F.Fab") (width 0.1) (fill none) (tstamp 1036b0d1-04dd-4d54-8f08-a83e7348d5e1))
  (pad "A1" smd circle (at -7.2 -7.2) (size 0.33 0.33) (layers "F.Cu" "F.Paste" "F.Mask")
    (solder_mask_margin 0.0762) (tstamp 9edac533-b3b5-4c9d-98ac-8cf3c8333e78))
  (pad "A2" smd circle (at -6.4 -7.2) (size 0.33 0.33) (layers "F.Cu" "F.Paste" "F.Mask")
    (solder_mask_margin 0.0762) (tstamp 9348cea7-c07a-471d-acad-2169fdb18a13))
  (pad "A3" smd circle (at -5.6 -7.2) (size 0.33 0.33) (layers "F.Cu" "F.Paste" "F.Mask")
    (solder_mask_margin 0.0762) (tstamp f1057476-91b2-4c10-a848-6c5bc2403fb6))
  (pad "A4" smd circle (at -4.8 -7.2) (size 0.33 0.33) (layers "F.Cu" "F.Paste" "F.Mask")
    (solder_mask_margin 0.0762) (tstamp b83670de-5a47-4d47-90ce-a87dd7cd91e4))
  (pad "A5" smd circle (at -4 -7.2) (size 0.33 0.33) (layers "F.Cu" "F.Paste" "F.Mask")
    (solder_mask_margin 0.0762) (tstamp c73ca981-71cf-4f32-b21e-3aa18b0f2771))
  (pad "A6" smd circle (at -3.2 -7.2) (size 0.33 0.33) (layers "F.Cu" "F.Paste" "F.Mask")
    (solder_mask_margin 0.0762) (tstamp fa6d6e90-d048-4f3a-a79f-affcfbfde13a))
  (pad "A7" smd circle (at -2.4 -7.2) (size 0.33 0.33) (layers "F.Cu" "F.Paste" "F.Mask")
    (solder_mask_margin 0.0762) (tstamp bc46cc22-8bb5-4f46-982d-72c3451e4d0b))
  (pad "A8" smd circle (at -1.6 -7.2) (size 0.33 0.33) (layers "F.Cu" "F.Paste" "F.Mask")
    (solder_mask_margin 0.0762) (tstamp ace607b7-50a0-4f7f-a3d0-720bdf5793e7))
  (pad "A9" smd circle (at -0.8 -7.2) (size 0.33 0.33) (layers "F.Cu" "F.Paste" "F.Mask")
    (solder_mask_margin 0.0762) (tstamp cdb5922b-a1e4-4bdd-a2b1-fb672cd6473e))
  (pad "A10" smd circle (at 0 -7.2) (size 0.33 0.33) (layers "F.Cu" "F.Paste" "F.Mask")
    (solder_mask_margin 0.0762) (tstamp 3f4cda04-1851-4515-81c1-7ed3ea535334))
  (pad "A11" smd circle (at 0.8 -7.2) (size 0.33 0.33) (layers "F.Cu" "F.Paste" "F.Mask")
    (solder_mask_margin 0.0762) (tstamp 4bf32638-8b39-4652-9eb4-5ea186c4114a))
  (pad "A12" smd circle (at 1.6 -7.2) (size 0.33 0.33) (layers "F.Cu" "F.Paste" "F.Mask")
    (solder_mask_margin 0.0762) (tstamp c981078c-6b09-47de-b0f0-df84e2ff85d2))
  (pad "A13" smd circle (at 2.4 -7.2) (size 0.33 0.33) (layers "F.Cu" "F.Paste" "F.Mask")
    (solder_mask_margin 0.0762) (tstamp 21731065-561a-4464-9aca-313859497b66))
  (pad "A14" smd circle (at 3.2 -7.2) (size 0.33 0.33) (layers "F.Cu" "F.Paste" "F.Mask")
    (solder_mask_margin 0.0762) (tstamp e0e9e462-e0be-4e11-a5f3-3d83973a85a9))
  (pad "A15" smd circle (at 4 -7.2) (size 0.33 0.33) (layers "F.Cu" "F.Paste" "F.Mask")
    (solder_mask_margin 0.0762) (tstamp 9058286e-df80-4537-829e-b8ac19c157a9))
  (pad "A16" smd circle (at 4.8 -7.2) (size 0.33 0.33) (layers "F.Cu" "F.Paste" "F.Mask")
    (solder_mask_margin 0.0762) (tstamp b7774a22-b5b5-465e-b2f8-2e59c355fb6a))
  (pad "A17" smd circle (at 5.6 -7.2) (size 0.33 0.33) (layers "F.Cu" "F.Paste" "F.Mask")
    (solder_mask_margin 0.0762) (tstamp f912d800-4e3d-46ab-8abe-3e49d5025792))
  (pad "A18" smd circle (at 6.4 -7.2) (size 0.33 0.33) (layers "F.Cu" "F.Paste" "F.Mask")
    (solder_mask_margin 0.0762) (tstamp 5dc19bc1-cdf4-40ce-97e7-17d4e845952e))
  (pad "A19" smd circle (at 7.2 -7.2) (size 0.33 0.33) (layers "F.Cu" "F.Paste" "F.Mask")
    (solder_mask_margin 0.0762) (tstamp 560f4129-4666-44a1-a5cf-33fe72cd7992))
  (pad "B1" smd circle (at -7.2 -6.4) (size 0.33 0.33) (layers "F.Cu" "F.Paste" "F.Mask")
    (solder_mask_margin 0.0762) (tstamp 2dd8db61-acaa-4e9d-b841-68c4e1e379b0))
  (pad "B2" smd circle (at -6.4 -6.4) (size 0.33 0.33) (layers "F.Cu" "F.Paste" "F.Mask")
    (solder_mask_margin 0.0762) (tstamp b405e5bb-a53f-4557-ba2a-9f9c96b4fc57))
  (pad "B3" smd circle (at -5.6 -6.4) (size 0.33 0.33) (layers "F.Cu" "F.Paste" "F.Mask")
    (solder_mask_margin 0.0762) (tstamp bda64631-b528-47d2-a4ca-7009de711911))
  (pad "B4" smd circle (at -4.8 -6.4) (size 0.33 0.33) (layers "F.Cu" "F.Paste" "F.Mask")
    (solder_mask_margin 0.0762) (tstamp 86421376-9ff6-4fc9-92cf-a00ee3968d53))
  (pad "B5" smd circle (at -4 -6.4) (size 0.33 0.33) (layers "F.Cu" "F.Paste" "F.Mask")
    (solder_mask_margin 0.0762) (tstamp bb040bb6-21c1-4131-8a82-4fe9bc166708))
  (pad "B6" smd circle (at -3.2 -6.4) (size 0.33 0.33) (layers "F.Cu" "F.Paste" "F.Mask")
    (solder_mask_margin 0.0762) (tstamp 79bc70cc-c171-4684-b512-979a481ff3cf))
  (pad "B7" smd circle (at -2.4 -6.4) (size 0.33 0.33) (layers "F.Cu" "F.Paste" "F.Mask")
    (solder_mask_margin 0.0762) (tstamp fa0d7f33-d470-4955-a573-81e8d28e4921))
  (pad "B8" smd circle (at -1.6 -6.4) (size 0.33 0.33) (layers "F.Cu" "F.Paste" "F.Mask")
    (solder_mask_margin 0.0762) (tstamp 93d30463-96e7-4cc2-a706-435daa1aeac9))
  (pad "B9" smd circle (at -0.8 -6.4) (size 0.33 0.33) (layers "F.Cu" "F.Paste" "F.Mask")
    (solder_mask_margin 0.0762) (tstamp 1a610dd2-93ba-49e3-a5a0-2cbf4984841b))
  (pad "B10" smd circle (at 0 -6.4) (size 0.33 0.33) (layers "F.Cu" "F.Paste" "F.Mask")
    (solder_mask_margin 0.0762) (tstamp cb71d287-813b-4a49-94e8-64998f87825c))
  (pad "B11" smd circle (at 0.8 -6.4) (size 0.33 0.33) (layers "F.Cu" "F.Paste" "F.Mask")
    (solder_mask_margin 0.0762) (tstamp 2b4cc69a-22f2-4fa8-bb7a-10b454f30519))
  (pad "B12" smd circle (at 1.6 -6.4) (size 0.33 0.33) (layers "F.Cu" "F.Paste" "F.Mask")
    (solder_mask_margin 0.0762) (tstamp d39264ee-84b0-41d2-9f0b-3c642922adbe))
  (pad "B13" smd circle (at 2.4 -6.4) (size 0.33 0.33) (layers "F.Cu" "F.Paste" "F.Mask")
    (solder_mask_margin 0.0762) (tstamp 947413dd-6626-483b-b8b1-f57b612741b0))
  (pad "B14" smd circle (at 3.2 -6.4) (size 0.33 0.33) (layers "F.Cu" "F.Paste" "F.Mask")
    (solder_mask_margin 0.0762) (tstamp 29480ff9-49b1-4dc7-828c-66a0cf489276))
  (pad "B15" smd circle (at 4 -6.4) (size 0.33 0.33) (layers "F.Cu" "F.Paste" "F.Mask")
    (solder_mask_margin 0.0762) (tstamp 6ed097a4-7940-414f-8342-79ab49797532))
  (pad "B16" smd circle (at 4.8 -6.4) (size 0.33 0.33) (layers "F.Cu" "F.Paste" "F.Mask")
    (solder_mask_margin 0.0762) (tstamp cf58a634-dc69-4504-b991-dd1191d4eea4))
  (pad "B17" smd circle (at 5.6 -6.4) (size 0.33 0.33) (layers "F.Cu" "F.Paste" "F.Mask")
    (solder_mask_margin 0.0762) (tstamp 38c49927-6444-4460-b8d4-75fffcbd325f))
  (pad "B18" smd circle (at 6.4 -6.4) (size 0.33 0.33) (layers "F.Cu" "F.Paste" "F.Mask")
    (solder_mask_margin 0.0762) (tstamp e345bc90-4b8f-43a8-a33f-9595cf651c33))
  (pad "B19" smd circle (at 7.2 -6.4) (size 0.33 0.33) (layers "F.Cu" "F.Paste" "F.Mask")
    (solder_mask_margin 0.0762) (tstamp e48cae1d-2611-4b22-b185-5e3fe935d1ac))
  (pad "C1" smd circle (at -7.2 -5.6) (size 0.33 0.33) (layers "F.Cu" "F.Paste" "F.Mask")
    (solder_mask_margin 0.0762) (tstamp 7e5ddaf4-00a7-4268-9a4d-063627f32605))
  (pad "C2" smd circle (at -6.4 -5.6) (size 0.33 0.33) (layers "F.Cu" "F.Paste" "F.Mask")
    (solder_mask_margin 0.0762) (tstamp 67984727-3a20-4115-bf37-64db588e8bb9))
  (pad "C3" smd circle (at -5.6 -5.6) (size 0.33 0.33) (layers "F.Cu" "F.Paste" "F.Mask")
    (solder_mask_margin 0.0762) (tstamp 468e7656-afa5-4541-ad18-acdf804c837d))
  (pad "C4" smd circle (at -4.8 -5.6) (size 0.33 0.33) (layers "F.Cu" "F.Paste" "F.Mask")
    (solder_mask_margin 0.0762) (tstamp c210bb6f-4cf0-440d-b0be-be4a85980fc8))
  (pad "C5" smd circle (at -4 -5.6) (size 0.33 0.33) (layers "F.Cu" "F.Paste" "F.Mask")
    (solder_mask_margin 0.0762) (tstamp d58b27c0-1084-4fb0-80bb-7ad18aee9f58))
  (pad "C6" smd circle (at -3.2 -5.6) (size 0.33 0.33) (layers "F.Cu" "F.Paste" "F.Mask")
    (solder_mask_margin 0.0762) (tstamp b1cebbd0-f1df-4740-9cbb-6710306ff745))
  (pad "C7" smd circle (at -2.4 -5.6) (size 0.33 0.33) (layers "F.Cu" "F.Paste" "F.Mask")
    (solder_mask_margin 0.0762) (tstamp 7bb4ec4e-fc8d-493d-924d-fb04792dc113))
  (pad "C8" smd circle (at -1.6 -5.6) (size 0.33 0.33) (layers "F.Cu" "F.Paste" "F.Mask")
    (solder_mask_margin 0.0762) (tstamp 629d3d1e-9220-4381-af04-54399f73f5bc))
  (pad "C9" smd circle (at -0.8 -5.6) (size 0.33 0.33) (layers "F.Cu" "F.Paste" "F.Mask")
    (solder_mask_margin 0.0762) (tstamp 4ba8e5f6-597e-430c-bcdc-190439e0497d))
  (pad "C10" smd circle (at 0 -5.6) (size 0.33 0.33) (layers "F.Cu" "F.Paste" "F.Mask")
    (solder_mask_margin 0.0762) (tstamp 829791c3-24fd-4927-a3d3-7bdaf1b7a3e6))
  (pad "C11" smd circle (at 0.8 -5.6) (size 0.33 0.33) (layers "F.Cu" "F.Paste" "F.Mask")
    (solder_mask_margin 0.0762) (tstamp edd0930e-be61-4fa6-99cd-4c280276e903))
  (pad "C12" smd circle (at 1.6 -5.6) (size 0.33 0.33) (layers "F.Cu" "F.Paste" "F.Mask")
    (solder_mask_margin 0.0762) (tstamp f7711842-3190-45f6-8285-a1ca80dc43f4))
  (pad "C13" smd circle (at 2.4 -5.6) (size 0.33 0.33) (layers "F.Cu" "F.Paste" "F.Mask")
    (solder_mask_margin 0.0762) (tstamp 1d5f54d2-b98e-433c-8e4f-35780943f5f7))
  (pad "C14" smd circle (at 3.2 -5.6) (size 0.33 0.33) (layers "F.Cu" "F.Paste" "F.Mask")
    (solder_mask_margin 0.0762) (tstamp c80eb251-774b-4eba-ae03-9400df236e70))
  (pad "C15" smd circle (at 4 -5.6) (size 0.33 0.33) (layers "F.Cu" "F.Paste" "F.Mask")
    (solder_mask_margin 0.0762) (tstamp fee6f877-de18-4a70-9194-4d659ffc0039))
  (pad "C16" smd circle (at 4.8 -5.6) (size 0.33 0.33) (layers "F.Cu" "F.Paste" "F.Mask")
    (solder_mask_margin 0.0762) (tstamp 5b425795-9fc0-4223-b28c-c0472f90dfdf))
  (pad "C17" smd circle (at 5.6 -5.6) (size 0.33 0.33) (layers "F.Cu" "F.Paste" "F.Mask")
    (solder_mask_margin 0.0762) (tstamp 772d3cea-dc7e-404a-9671-64a8e5f370e3))
  (pad "C18" smd circle (at 6.4 -5.6) (size 0.33 0.33) (layers "F.Cu" "F.Paste" "F.Mask")
    (solder_mask_margin 0.0762) (tstamp 0ce86b9e-ebed-4830-bcd4-7a80864849ab))
  (pad "C19" smd circle (at 7.2 -5.6) (size 0.33 0.33) (layers "F.Cu" "F.Paste" "F.Mask")
    (solder_mask_margin 0.0762) (tstamp 1d1a4dc2-42c0-4f9a-b226-a3a661afb2d6))
  (pad "D1" smd circle (at -7.2 -4.8) (size 0.33 0.33) (layers "F.Cu" "F.Paste" "F.Mask")
    (solder_mask_margin 0.0762) (tstamp 9991563e-6700-4e9a-a720-2709555b6f7d))
  (pad "D2" smd circle (at -6.4 -4.8) (size 0.33 0.33) (layers "F.Cu" "F.Paste" "F.Mask")
    (solder_mask_margin 0.0762) (tstamp a23897da-250a-48ad-b8d1-7e4cd45c6f08))
  (pad "D3" smd circle (at -5.6 -4.8) (size 0.33 0.33) (layers "F.Cu" "F.Paste" "F.Mask")
    (solder_mask_margin 0.0762) (tstamp a6ed0464-7b36-48df-bbeb-21a49de0843b))
  (pad "D4" smd circle (at -4.8 -4.8) (size 0.33 0.33) (layers "F.Cu" "F.Paste" "F.Mask")
    (solder_mask_margin 0.0762) (tstamp 979b52ae-d42c-455b-a3b6-602b1782bcb3))
  (pad "D5" smd circle (at -4 -4.8) (size 0.33 0.33) (layers "F.Cu" "F.Paste" "F.Mask")
    (solder_mask_margin 0.0762) (tstamp 6525b59d-3fe8-4629-a65a-c87d37451c08))
  (pad "D6" smd circle (at -3.2 -4.8) (size 0.33 0.33) (layers "F.Cu" "F.Paste" "F.Mask")
    (solder_mask_margin 0.0762) (tstamp 6f5de9eb-b086-4809-b3f6-08781c0e2e4d))
  (pad "D7" smd circle (at -2.4 -4.8) (size 0.33 0.33) (layers "F.Cu" "F.Paste" "F.Mask")
    (solder_mask_margin 0.0762) (tstamp ab1a8e22-31c5-4682-bb12-1766c1158bd0))
  (pad "D8" smd circle (at -1.6 -4.8) (size 0.33 0.33) (layers "F.Cu" "F.Paste" "F.Mask")
    (solder_mask_margin 0.0762) (tstamp 2efe8de2-0b02-47e6-91fc-0f60fc684995))
  (pad "D9" smd circle (at -0.8 -4.8) (size 0.33 0.33) (layers "F.Cu" "F.Paste" "F.Mask")
    (solder_mask_margin 0.0762) (tstamp fbac4933-8fa1-490e-9075-c3490846f56e))
  (pad "D10" smd circle (at 0 -4.8) (size 0.33 0.33) (layers "F.Cu" "F.Paste" "F.Mask")
    (solder_mask_margin 0.0762) (tstamp dd4b9354-8120-4321-87ee-9eccf6be71ec))
  (pad "D11" smd circle (at 0.8 -4.8) (size 0.33 0.33) (layers "F.Cu" "F.Paste" "F.Mask")
    (solder_mask_margin 0.0762) (tstamp b1ee28b3-bb95-412b-a5aa-84f2941f7db1))
  (pad "D12" smd circle (at 1.6 -4.8) (size 0.33 0.33) (layers "F.Cu" "F.Paste" "F.Mask")
    (solder_mask_margin 0.0762) (tstamp 2ccf8269-aa88-413c-85b4-1cf69b0dc9b3))
  (pad "D13" smd circle (at 2.4 -4.8) (size 0.33 0.33) (layers "F.Cu" "F.Paste" "F.Mask")
    (solder_mask_margin 0.0762) (tstamp 14a1c97c-c18e-42a0-97aa-e1011275448b))
  (pad "D14" smd circle (at 3.2 -4.8) (size 0.33 0.33) (layers "F.Cu" "F.Paste" "F.Mask")
    (solder_mask_margin 0.0762) (tstamp e4da50b9-8ddc-4bbb-858f-f10c1edee0b7))
  (pad "D15" smd circle (at 4 -4.8) (size 0.33 0.33) (layers "F.Cu" "F.Paste" "F.Mask")
    (solder_mask_margin 0.0762) (tstamp 80c63155-d9ac-42a4-851f-97901a31a023))
  (pad "D16" smd circle (at 4.8 -4.8) (size 0.33 0.33) (layers "F.Cu" "F.Paste" "F.Mask")
    (solder_mask_margin 0.0762) (tstamp bc7222f9-85da-4af5-937c-a77bbee6fb37))
  (pad "D17" smd circle (at 5.6 -4.8) (size 0.33 0.33) (layers "F.Cu" "F.Paste" "F.Mask")
    (solder_mask_margin 0.0762) (tstamp 49b1531e-c91f-4e60-bc70-7d80246afd9a))
  (pad "D18" smd circle (at 6.4 -4.8) (size 0.33 0.33) (layers "F.Cu" "F.Paste" "F.Mask")
    (solder_mask_margin 0.0762) (tstamp 3806d464-70e9-46a7-8a5a-f18609a6d899))
  (pad "D19" smd circle (at 7.2 -4.8) (size 0.33 0.33) (layers "F.Cu" "F.Paste" "F.Mask")
    (solder_mask_margin 0.0762) (tstamp e405b58a-5b12-49be-9922-d0e4369cf688))
  (pad "E1" smd circle (at -7.2 -4) (size 0.33 0.33) (layers "F.Cu" "F.Paste" "F.Mask")
    (solder_mask_margin 0.0762) (tstamp 59447725-3768-4d52-b642-e426f03b277a))
  (pad "E2" smd circle (at -6.4 -4) (size 0.33 0.33) (layers "F.Cu" "F.Paste" "F.Mask")
    (solder_mask_margin 0.0762) (tstamp 5c2aaa6c-7a8d-465f-82f6-c84b9a9294a0))
  (pad "E3" smd circle (at -5.6 -4) (size 0.33 0.33) (layers "F.Cu" "F.Paste" "F.Mask")
    (solder_mask_margin 0.0762) (tstamp 56a98b2f-dc3b-4315-bc9b-a76646c5f02c))
  (pad "E4" smd circle (at -4.8 -4) (size 0.33 0.33) (layers "F.Cu" "F.Paste" "F.Mask")
    (solder_mask_margin 0.0762) (tstamp c16b42fe-0078-473e-a60b-1e02004bdfc6))
  (pad "E5" smd circle (at -4 -4) (size 0.33 0.33) (layers "F.Cu" "F.Paste" "F.Mask")
    (solder_mask_margin 0.0762) (tstamp 47a627cb-dbf9-4ee1-87c8-6c412c6eadf6))
  (pad "E6" smd circle (at -3.2 -4) (size 0.33 0.33) (layers "F.Cu" "F.Paste" "F.Mask")
    (solder_mask_margin 0.0762) (tstamp 4c5753d3-e5cf-4ab5-89cb-fe17153d68f6))
  (pad "E7" smd circle (at -2.4 -4) (size 0.33 0.33) (layers "F.Cu" "F.Paste" "F.Mask")
    (solder_mask_margin 0.0762) (tstamp d0bcadc0-8062-4a79-9b56-e3592d090664))
  (pad "E8" smd circle (at -1.6 -4) (size 0.33 0.33) (layers "F.Cu" "F.Paste" "F.Mask")
    (solder_mask_margin 0.0762) (tstamp 63875d8e-a22c-40f6-b40f-aa5b41a51da8))
  (pad "E9" smd circle (at -0.8 -4) (size 0.33 0.33) (layers "F.Cu" "F.Paste" "F.Mask")
    (solder_mask_margin 0.0762) (tstamp 9adc23ad-76c5-47ba-96d1-fc35fa330e05))
  (pad "E10" smd circle (at 0 -4) (size 0.33 0.33) (layers "F.Cu" "F.Paste" "F.Mask")
    (solder_mask_margin 0.0762) (tstamp b355ae5e-828b-44e0-a035-f90719822089))
  (pad "E11" smd circle (at 0.8 -4) (size 0.33 0.33) (layers "F.Cu" "F.Paste" "F.Mask")
    (solder_mask_margin 0.0762) (tstamp ace7023d-7301-46ce-9e39-7a7ece54b834))
  (pad "E12" smd circle (at 1.6 -4) (size 0.33 0.33) (layers "F.Cu" "F.Paste" "F.Mask")
    (solder_mask_margin 0.0762) (tstamp 01e6fa5b-00f7-4f87-ac39-a8e37658a816))
  (pad "E13" smd circle (at 2.4 -4) (size 0.33 0.33) (layers "F.Cu" "F.Paste" "F.Mask")
    (solder_mask_margin 0.0762) (tstamp 887d969f-906b-499a-aadb-7acffed820bb))
  (pad "E14" smd circle (at 3.2 -4) (size 0.33 0.33) (layers "F.Cu" "F.Paste" "F.Mask")
    (solder_mask_margin 0.0762) (tstamp 68287571-d876-4922-a8b1-68447cd3313c))
  (pad "E15" smd circle (at 4 -4) (size 0.33 0.33) (layers "F.Cu" "F.Paste" "F.Mask")
    (solder_mask_margin 0.0762) (tstamp 6bb410ef-baee-442a-9c79-7d15078936cd))
  (pad "E16" smd circle (at 4.8 -4) (size 0.33 0.33) (layers "F.Cu" "F.Paste" "F.Mask")
    (solder_mask_margin 0.0762) (tstamp a427cd29-1289-4f88-a440-1171f1098ce5))
  (pad "E17" smd circle (at 5.6 -4) (size 0.33 0.33) (layers "F.Cu" "F.Paste" "F.Mask")
    (solder_mask_margin 0.0762) (tstamp 6504e005-70de-4a9f-a05f-d1bbfe58aecf))
  (pad "E18" smd circle (at 6.4 -4) (size 0.33 0.33) (layers "F.Cu" "F.Paste" "F.Mask")
    (solder_mask_margin 0.0762) (tstamp c54deaee-9a1d-4bc1-8c4d-9fc8afbef333))
  (pad "F1" smd circle (at -7.2 -3.2) (size 0.33 0.33) (layers "F.Cu" "F.Paste" "F.Mask")
    (solder_mask_margin 0.0762) (tstamp 611a60a4-1bd1-4fe5-a4cf-7c3d6c873956))
  (pad "F2" smd circle (at -6.4 -3.2) (size 0.33 0.33) (layers "F.Cu" "F.Paste" "F.Mask")
    (solder_mask_margin 0.0762) (tstamp aa7aec69-26d5-49c4-aa8f-2811432a1bd2))
  (pad "F3" smd circle (at -5.6 -3.2) (size 0.33 0.33) (layers "F.Cu" "F.Paste" "F.Mask")
    (solder_mask_margin 0.0762) (tstamp c21ffed3-2026-4fa1-ad79-ce701b2f2e50))
  (pad "F4" smd circle (at -4.8 -3.2) (size 0.33 0.33) (layers "F.Cu" "F.Paste" "F.Mask")
    (solder_mask_margin 0.0762) (tstamp 2753f7a9-4a34-4a3c-bc1c-159f6e419999))
  (pad "F5" smd circle (at -4 -3.2) (size 0.33 0.33) (layers "F.Cu" "F.Paste" "F.Mask")
    (solder_mask_margin 0.0762) (tstamp 7ddbe7a4-4f55-43f4-b4e1-7a391b5e924e))
  (pad "F6" smd circle (at -3.2 -3.2) (size 0.33 0.33) (layers "F.Cu" "F.Paste" "F.Mask")
    (solder_mask_margin 0.0762) (tstamp 2909b082-cb3e-4c8a-9402-5d8884eabbcb))
  (pad "F7" smd circle (at -2.4 -3.2) (size 0.33 0.33) (layers "F.Cu" "F.Paste" "F.Mask")
    (solder_mask_margin 0.0762) (tstamp 9fbcf60b-69de-4da6-b2b8-4461d451e106))
  (pad "F8" smd circle (at -1.6 -3.2) (size 0.33 0.33) (layers "F.Cu" "F.Paste" "F.Mask")
    (solder_mask_margin 0.0762) (tstamp 844ed45b-4260-4f06-a96e-d448b7444e08))
  (pad "F9" smd circle (at -0.8 -3.2) (size 0.33 0.33) (layers "F.Cu" "F.Paste" "F.Mask")
    (solder_mask_margin 0.0762) (tstamp 90197cb6-7949-405f-8fea-42c489a68aaa))
  (pad "F10" smd circle (at 0 -3.2) (size 0.33 0.33) (layers "F.Cu" "F.Paste" "F.Mask")
    (solder_mask_margin 0.0762) (tstamp 496a83bf-6923-4df5-830a-78d1a12cb78e))
  (pad "F11" smd circle (at 0.8 -3.2) (size 0.33 0.33) (layers "F.Cu" "F.Paste" "F.Mask")
    (solder_mask_margin 0.0762) (tstamp 49c3ad20-a0b3-4f78-8feb-35a241c427ad))
  (pad "F12" smd circle (at 1.6 -3.2) (size 0.33 0.33) (layers "F.Cu" "F.Paste" "F.Mask")
    (solder_mask_margin 0.0762) (tstamp d19c7ae9-65fc-4ecd-9456-7cba1462ddbe))
  (pad "F13" smd circle (at 2.4 -3.2) (size 0.33 0.33) (layers "F.Cu" "F.Paste" "F.Mask")
    (solder_mask_margin 0.0762) (tstamp 6ccc4acf-9e52-4ef4-bff6-db8a6f5548e5))
  (pad "F14" smd circle (at 3.2 -3.2) (size 0.33 0.33) (layers "F.Cu" "F.Paste" "F.Mask")
    (solder_mask_margin 0.0762) (tstamp c0385f19-0830-4f7a-9270-0d8a7f828c45))
  (pad "F15" smd circle (at 4 -3.2) (size 0.33 0.33) (layers "F.Cu" "F.Paste" "F.Mask")
    (solder_mask_margin 0.0762) (tstamp 874abf5d-4f4d-4f39-b4a2-71d227346b81))
  (pad "F17" smd circle (at 5.6 -3.2) (size 0.33 0.33) (layers "F.Cu" "F.Paste" "F.Mask")
    (solder_mask_margin 0.0762) (tstamp 7ca93992-2bd5-42d5-8615-e3e061f6e4bc))
  (pad "F18" smd circle (at 6.4 -3.2) (size 0.33 0.33) (layers "F.Cu" "F.Paste" "F.Mask")
    (solder_mask_margin 0.0762) (tstamp 796c82ac-5146-45b4-92ac-f84708b9aabf))
  (pad "F19" smd circle (at 7.2 -3.2) (size 0.33 0.33) (layers "F.Cu" "F.Paste" "F.Mask")
    (solder_mask_margin 0.0762) (tstamp 54fcb895-163b-4fc4-afd6-175d01d465fe))
  (pad "G1" smd circle (at -7.2 -2.4) (size 0.33 0.33) (layers "F.Cu" "F.Paste" "F.Mask")
    (solder_mask_margin 0.0762) (tstamp 2f64bb6c-dfc8-4206-85c2-60698ac1dea4))
  (pad "G2" smd circle (at -6.4 -2.4) (size 0.33 0.33) (layers "F.Cu" "F.Paste" "F.Mask")
    (solder_mask_margin 0.0762) (tstamp c7f78da5-b7f2-4a66-b521-efd9cd509c8b))
  (pad "G3" smd circle (at -5.6 -2.4) (size 0.33 0.33) (layers "F.Cu" "F.Paste" "F.Mask")
    (solder_mask_margin 0.0762) (tstamp 6ed55029-dadd-4731-8a4e-2bd19bc3b5f9))
  (pad "G4" smd circle (at -4.8 -2.4) (size 0.33 0.33) (layers "F.Cu" "F.Paste" "F.Mask")
    (solder_mask_margin 0.0762) (tstamp fa662184-7113-4c1c-b8e4-066b0ae818ea))
  (pad "G5" smd circle (at -4 -2.4) (size 0.33 0.33) (layers "F.Cu" "F.Paste" "F.Mask")
    (solder_mask_margin 0.0762) (tstamp e739a5f8-bd2f-4f56-982a-8c83002f68e7))
  (pad "G6" smd circle (at -3.2 -2.4) (size 0.33 0.33) (layers "F.Cu" "F.Paste" "F.Mask")
    (solder_mask_margin 0.0762) (tstamp e0b2f304-a1c4-4e8a-aac1-0eaf4b262f47))
  (pad "G7" smd circle (at -2.4 -2.4) (size 0.33 0.33) (layers "F.Cu" "F.Paste" "F.Mask")
    (solder_mask_margin 0.0762) (tstamp 638e7220-e532-4971-b1a9-95dffa79a902))
  (pad "G8" smd circle (at -1.6 -2.4) (size 0.33 0.33) (layers "F.Cu" "F.Paste" "F.Mask")
    (solder_mask_margin 0.0762) (tstamp ac8aaf77-6c1b-490e-a47f-e316a68a6092))
  (pad "G9" smd circle (at -0.8 -2.4) (size 0.33 0.33) (layers "F.Cu" "F.Paste" "F.Mask")
    (solder_mask_margin 0.0762) (tstamp 6c2d98f2-42a7-4943-8bfa-8b1af07a3840))
  (pad "G10" smd circle (at 0 -2.4) (size 0.33 0.33) (layers "F.Cu" "F.Paste" "F.Mask")
    (solder_mask_margin 0.0762) (tstamp 581cfa2c-11a3-4160-806f-505107410b08))
  (pad "G11" smd circle (at 0.8 -2.4) (size 0.33 0.33) (layers "F.Cu" "F.Paste" "F.Mask")
    (solder_mask_margin 0.0762) (tstamp c1681cac-d2fa-46cf-9f56-4a04d2118b4a))
  (pad "G12" smd circle (at 1.6 -2.4) (size 0.33 0.33) (layers "F.Cu" "F.Paste" "F.Mask")
    (solder_mask_margin 0.0762) (tstamp 1b052d19-3846-4e85-941b-ba371fb1cc58))
  (pad "G13" smd circle (at 2.4 -2.4) (size 0.33 0.33) (layers "F.Cu" "F.Paste" "F.Mask")
    (solder_mask_margin 0.0762) (tstamp 52e51cf4-2011-435d-a8f6-002205793a96))
  (pad "G14" smd circle (at 3.2 -2.4) (size 0.33 0.33) (layers "F.Cu" "F.Paste" "F.Mask")
    (solder_mask_margin 0.0762) (tstamp 9e165842-2c04-458b-baeb-3ef08a3f8ded))
  (pad "G15" smd circle (at 4 -2.4) (size 0.33 0.33) (layers "F.Cu" "F.Paste" "F.Mask")
    (solder_mask_margin 0.0762) (tstamp 02dabf3a-dddb-4768-813b-13a9ccece1d2))
  (pad "G16" smd circle (at 4.8 -2.4) (size 0.33 0.33) (layers "F.Cu" "F.Paste" "F.Mask")
    (solder_mask_margin 0.0762) (tstamp c4869ae2-e5fb-449a-94ff-8c8c29a9b3c9))
  (pad "G17" smd circle (at 5.6 -2.4) (size 0.33 0.33) (layers "F.Cu" "F.Paste" "F.Mask")
    (solder_mask_margin 0.0762) (tstamp 0abd7063-2b7e-42a0-89a6-06f1cb6f0f45))
  (pad "G18" smd circle (at 6.4 -2.4) (size 0.33 0.33) (layers "F.Cu" "F.Paste" "F.Mask")
    (solder_mask_margin 0.0762) (tstamp f877fe16-b256-47ac-8fcb-e07bad8c97c6))
  (pad "G19" smd circle (at 7.2 -2.4) (size 0.33 0.33) (layers "F.Cu" "F.Paste" "F.Mask")
    (solder_mask_margin 0.0762) (tstamp 82797eea-ad1d-46ef-a5a5-41fb2853d37c))
  (pad "H1" smd circle (at -7.2 -1.6) (size 0.33 0.33) (layers "F.Cu" "F.Paste" "F.Mask")
    (solder_mask_margin 0.0762) (tstamp fff68742-84fa-4c86-8f54-32f5583456eb))
  (pad "H2" smd circle (at -6.4 -1.6) (size 0.33 0.33) (layers "F.Cu" "F.Paste" "F.Mask")
    (solder_mask_margin 0.0762) (tstamp 03835304-0897-481b-9a66-e2db6a33e575))
  (pad "H3" smd circle (at -5.6 -1.6) (size 0.33 0.33) (layers "F.Cu" "F.Paste" "F.Mask")
    (solder_mask_margin 0.0762) (tstamp 7920b3ce-8bb5-4d09-b1f6-e0316b22de2f))
  (pad "H4" smd circle (at -4.8 -1.6) (size 0.33 0.33) (layers "F.Cu" "F.Paste" "F.Mask")
    (solder_mask_margin 0.0762) (tstamp 07511099-6459-4627-8c3f-c6e052201ad3))
  (pad "H5" smd circle (at -4 -1.6) (size 0.33 0.33) (layers "F.Cu" "F.Paste" "F.Mask")
    (solder_mask_margin 0.0762) (tstamp f73fe1a0-ea70-463a-9044-d6296922b7b4))
  (pad "H6" smd circle (at -3.2 -1.6) (size 0.33 0.33) (layers "F.Cu" "F.Paste" "F.Mask")
    (solder_mask_margin 0.0762) (tstamp 0121cac5-115e-4044-bc62-2b95628a2bdd))
  (pad "H7" smd circle (at -2.4 -1.6) (size 0.33 0.33) (layers "F.Cu" "F.Paste" "F.Mask")
    (solder_mask_margin 0.0762) (tstamp b2fbb204-0f0a-4f70-ad95-a9391abf031b))
  (pad "H8" smd circle (at -1.6 -1.6) (size 0.33 0.33) (layers "F.Cu" "F.Paste" "F.Mask")
    (solder_mask_margin 0.0762) (tstamp 34912626-d263-47db-93c8-9b58cfa24e90))
  (pad "H9" smd circle (at -0.8 -1.6) (size 0.33 0.33) (layers "F.Cu" "F.Paste" "F.Mask")
    (solder_mask_margin 0.0762) (tstamp 51b82480-d923-4119-b4cc-6cfe44761aef))
  (pad "H10" smd circle (at 0 -1.6) (size 0.33 0.33) (layers "F.Cu" "F.Paste" "F.Mask")
    (solder_mask_margin 0.0762) (tstamp 3b1655b8-3a25-43e9-a0a1-100313c61ee6))
  (pad "H11" smd circle (at 0.8 -1.6) (size 0.33 0.33) (layers "F.Cu" "F.Paste" "F.Mask")
    (solder_mask_margin 0.0762) (tstamp c5dfe07a-9433-40b0-b7a3-f77cefaddec7))
  (pad "H12" smd circle (at 1.6 -1.6) (size 0.33 0.33) (layers "F.Cu" "F.Paste" "F.Mask")
    (solder_mask_margin 0.0762) (tstamp 3b979fcc-d309-46f4-b653-e78b793d455a))
  (pad "H13" smd circle (at 2.4 -1.6) (size 0.33 0.33) (layers "F.Cu" "F.Paste" "F.Mask")
    (solder_mask_margin 0.0762) (tstamp 06ff6491-b113-49ad-811c-18127e59476e))
  (pad "H14" smd circle (at 3.2 -1.6) (size 0.33 0.33) (layers "F.Cu" "F.Paste" "F.Mask")
    (solder_mask_margin 0.0762) (tstamp 75d47feb-9bf5-4272-b88d-e8f0d28e5a23))
  (pad "H15" smd circle (at 4 -1.6) (size 0.33 0.33) (layers "F.Cu" "F.Paste" "F.Mask")
    (solder_mask_margin 0.0762) (tstamp b01cbaf5-cf22-4e73-b185-9f26acda98e6))
  (pad "H17" smd circle (at 5.6 -1.6) (size 0.33 0.33) (layers "F.Cu" "F.Paste" "F.Mask")
    (solder_mask_margin 0.0762) (tstamp 67bfa3c9-adf6-4b15-ad14-36b34fa4eae2))
  (pad "H18" smd circle (at 6.4 -1.6) (size 0.33 0.33) (layers "F.Cu" "F.Paste" "F.Mask")
    (solder_mask_margin 0.0762) (tstamp 2069def9-fa8e-4820-8284-b0f96ce48403))
  (pad "H19" smd circle (at 7.2 -1.6) (size 0.33 0.33) (layers "F.Cu" "F.Paste" "F.Mask")
    (solder_mask_margin 0.0762) (tstamp 2960fa60-da38-4cdc-8128-0a2d5de97474))
  (pad "J1" smd circle (at -7.2 -0.8) (size 0.33 0.33) (layers "F.Cu" "F.Paste" "F.Mask")
    (solder_mask_margin 0.0762) (tstamp 7dfce41c-e1d9-42e8-99e1-2809840a59f1))
  (pad "J2" smd circle (at -6.4 -0.8) (size 0.33 0.33) (layers "F.Cu" "F.Paste" "F.Mask")
    (solder_mask_margin 0.0762) (tstamp e0b03d18-a281-4f13-8e22-c60d536d4b69))
  (pad "J3" smd circle (at -5.6 -0.8) (size 0.33 0.33) (layers "F.Cu" "F.Paste" "F.Mask")
    (solder_mask_margin 0.0762) (tstamp 56752ef8-b8a2-4f5d-aa3b-bed2188c1a13))
  (pad "J4" smd circle (at -4.8 -0.8) (size 0.33 0.33) (layers "F.Cu" "F.Paste" "F.Mask")
    (solder_mask_margin 0.0762) (tstamp 97b8bbf9-394c-4f09-9be2-c60eb69de473))
  (pad "J5" smd circle (at -4 -0.8) (size 0.33 0.33) (layers "F.Cu" "F.Paste" "F.Mask")
    (solder_mask_margin 0.0762) (tstamp 9d0d7fb0-e36f-45f8-b384-4a20964d8595))
  (pad "J6" smd circle (at -3.2 -0.8) (size 0.33 0.33) (layers "F.Cu" "F.Paste" "F.Mask")
    (solder_mask_margin 0.0762) (tstamp 4366043a-d455-4a68-8bf7-b71227bc2c46))
  (pad "J7" smd circle (at -2.4 -0.8) (size 0.33 0.33) (layers "F.Cu" "F.Paste" "F.Mask")
    (solder_mask_margin 0.0762) (tstamp 24145154-33f0-4454-ac19-14257a870cb8))
  (pad "J8" smd circle (at -1.6 -0.8) (size 0.33 0.33) (layers "F.Cu" "F.Paste" "F.Mask")
    (solder_mask_margin 0.0762) (tstamp a1df3f3b-c8a6-4217-8ef6-9036604d6f71))
  (pad "J9" smd circle (at -0.8 -0.8) (size 0.33 0.33) (layers "F.Cu" "F.Paste" "F.Mask")
    (solder_mask_margin 0.0762) (tstamp 1bea497f-a84d-41fd-8c04-7c9432823fdb))
  (pad "J10" smd circle (at 0 -0.8) (size 0.33 0.33) (layers "F.Cu" "F.Paste" "F.Mask")
    (solder_mask_margin 0.0762) (tstamp 5439b77f-0e49-47ce-893f-3c1fd525661d))
  (pad "J11" smd circle (at 0.8 -0.8) (size 0.33 0.33) (layers "F.Cu" "F.Paste" "F.Mask")
    (solder_mask_margin 0.0762) (tstamp cd60acbe-3fdd-4705-8987-7a5934756b54))
  (pad "J12" smd circle (at 1.6 -0.8) (size 0.33 0.33) (layers "F.Cu" "F.Paste" "F.Mask")
    (solder_mask_margin 0.0762) (tstamp 8b24db59-107b-4f24-8515-b4b77240944f))
  (pad "J13" smd circle (at 2.4 -0.8) (size 0.33 0.33) (layers "F.Cu" "F.Paste" "F.Mask")
    (solder_mask_margin 0.0762) (tstamp 7899adef-801b-4bd8-9653-8e04f6fe04c3))
  (pad "J14" smd circle (at 3.2 -0.8) (size 0.33 0.33) (layers "F.Cu" "F.Paste" "F.Mask")
    (solder_mask_margin 0.0762) (tstamp 45301ee4-0a60-41a1-9e32-37900090c3af))
  (pad "J15" smd circle (at 4 -0.8) (size 0.33 0.33) (layers "F.Cu" "F.Paste" "F.Mask")
    (solder_mask_margin 0.0762) (tstamp a14e0f29-ca61-4fec-be90-abae98aabe88))
  (pad "J16" smd circle (at 4.8 -0.8) (size 0.33 0.33) (layers "F.Cu" "F.Paste" "F.Mask")
    (solder_mask_margin 0.0762) (tstamp 1601a85d-6a63-4b0f-b049-cde2632ab0f2))
  (pad "J17" smd circle (at 5.6 -0.8) (size 0.33 0.33) (layers "F.Cu" "F.Paste" "F.Mask")
    (solder_mask_margin 0.0762) (tstamp ac45d835-0d20-4153-946a-f62fd1560de2))
  (pad "J18" smd circle (at 6.4 -0.8) (size 0.33 0.33) (layers "F.Cu" "F.Paste" "F.Mask")
    (solder_mask_margin 0.0762) (tstamp ab7deea5-6e70-4c39-ab7d-f286b9fc9dbf))
  (pad "J19" smd circle (at 7.2 -0.8) (size 0.33 0.33) (layers "F.Cu" "F.Paste" "F.Mask")
    (solder_mask_margin 0.0762) (tstamp a8c9b268-deed-431a-8f05-c1fe455ad3e3))
  (pad "K1" smd circle (at -7.2 0) (size 0.33 0.33) (layers "F.Cu" "F.Paste" "F.Mask")
    (solder_mask_margin 0.0762) (tstamp 7b028444-321d-4e3c-b56d-d12cd9538091))
  (pad "K2" smd circle (at -6.4 0) (size 0.33 0.33) (layers "F.Cu" "F.Paste" "F.Mask")
    (solder_mask_margin 0.0762) (tstamp 40bc7522-b17d-4622-bebe-f463b738c3a8))
  (pad "K3" smd circle (at -5.6 0) (size 0.33 0.33) (layers "F.Cu" "F.Paste" "F.Mask")
    (solder_mask_margin 0.0762) (tstamp fcec13a5-1206-4152-ad9a-d7c4e525ca34))
  (pad "K4" smd circle (at -4.8 0) (size 0.33 0.33) (layers "F.Cu" "F.Paste" "F.Mask")
    (solder_mask_margin 0.0762) (tstamp 68e151d7-35df-4481-bd6a-3269e6b3d6bd))
  (pad "K5" smd circle (at -4 0) (size 0.33 0.33) (layers "F.Cu" "F.Paste" "F.Mask")
    (solder_mask_margin 0.0762) (tstamp 1575c284-e8bf-4094-b512-aa4d150317c2))
  (pad "K6" smd circle (at -3.2 0) (size 0.33 0.33) (layers "F.Cu" "F.Paste" "F.Mask")
    (solder_mask_margin 0.0762) (tstamp 4e6c4a9b-a5e9-4cdf-a44e-ebf20e2d43e8))
  (pad "K7" smd circle (at -2.4 0) (size 0.33 0.33) (layers "F.Cu" "F.Paste" "F.Mask")
    (solder_mask_margin 0.0762) (tstamp 8fbfbe69-292d-4eab-8d69-89650b1421fb))
  (pad "K8" smd circle (at -1.6 0) (size 0.33 0.33) (layers "F.Cu" "F.Paste" "F.Mask")
    (solder_mask_margin 0.0762) (tstamp fa1b4dd8-3ffa-43ca-87b7-f1fdd21cdb25))
  (pad "K9" smd circle (at -0.8 0) (size 0.33 0.33) (layers "F.Cu" "F.Paste" "F.Mask")
    (solder_mask_margin 0.0762) (tstamp 536d2deb-30b1-4dca-b845-1811aaa3992d))
  (pad "K10" smd circle (at 0 0) (size 0.33 0.33) (layers "F.Cu" "F.Paste" "F.Mask")
    (solder_mask_margin 0.0762) (tstamp 0cff5040-a1bf-4d2a-a95b-88c19242050a))
  (pad "K11" smd circle (at 0.8 0) (size 0.33 0.33) (layers "F.Cu" "F.Paste" "F.Mask")
    (solder_mask_margin 0.0762) (tstamp 2beaf6ca-2add-42d5-98d3-9ce235416bab))
  (pad "K12" smd circle (at 1.6 0) (size 0.33 0.33) (layers "F.Cu" "F.Paste" "F.Mask")
    (solder_mask_margin 0.0762) (tstamp 6bad5ea4-97d6-45e5-8d3b-344d33374891))
  (pad "K13" smd circle (at 2.4 0) (size 0.33 0.33) (layers "F.Cu" "F.Paste" "F.Mask")
    (solder_mask_margin 0.0762) (tstamp 506ae28c-26c6-4640-84e4-7bc0e7e07d3f))
  (pad "K14" smd circle (at 3.2 0) (size 0.33 0.33) (layers "F.Cu" "F.Paste" "F.Mask")
    (solder_mask_margin 0.0762) (tstamp 694e38e6-1ae2-49f3-97d9-727f34a83be9))
  (pad "K15" smd circle (at 4 0) (size 0.33 0.33) (layers "F.Cu" "F.Paste" "F.Mask")
    (solder_mask_margin 0.0762) (tstamp 1fa8a83f-b7a5-4cc9-9b15-2730c801a789))
  (pad "K17" smd circle (at 5.6 0) (size 0.33 0.33) (layers "F.Cu" "F.Paste" "F.Mask")
    (solder_mask_margin 0.0762) (tstamp 3c7d7657-59e3-4a11-b2da-32fc8309356f))
  (pad "K18" smd circle (at 6.4 0) (size 0.33 0.33) (layers "F.Cu" "F.Paste" "F.Mask")
    (solder_mask_margin 0.0762) (tstamp 7eda8faa-86b0-4aae-9a56-b2cdf9c4dc1b))
  (pad "K19" smd circle (at 7.2 0) (size 0.33 0.33) (layers "F.Cu" "F.Paste" "F.Mask")
    (solder_mask_margin 0.0762) (tstamp e5bbcf9a-8808-44c7-b6fb-6e6030f0cd82))
  (pad "L1" smd circle (at -7.2 0.8) (size 0.33 0.33) (layers "F.Cu" "F.Paste" "F.Mask")
    (solder_mask_margin 0.0762) (tstamp 9e84bdd7-4f5c-43ea-b011-f542e98eb181))
  (pad "L2" smd circle (at -6.4 0.8) (size 0.33 0.33) (layers "F.Cu" "F.Paste" "F.Mask")
    (solder_mask_margin 0.0762) (tstamp 0ff92d11-3541-4b91-9320-e7d71fb8bed1))
  (pad "L3" smd circle (at -5.6 0.8) (size 0.33 0.33) (layers "F.Cu" "F.Paste" "F.Mask")
    (solder_mask_margin 0.0762) (tstamp f4d415aa-0949-4604-8442-c948ee8d40b2))
  (pad "L4" smd circle (at -4.8 0.8) (size 0.33 0.33) (layers "F.Cu" "F.Paste" "F.Mask")
    (solder_mask_margin 0.0762) (tstamp 2606743a-2ca1-4cd1-92cc-dcae67ef7eed))
  (pad "L5" smd circle (at -4 0.8) (size 0.33 0.33) (layers "F.Cu" "F.Paste" "F.Mask")
    (solder_mask_margin 0.0762) (tstamp 189cd1a5-fd8d-4626-bfd8-b61e0110ac06))
  (pad "L6" smd circle (at -3.2 0.8) (size 0.33 0.33) (layers "F.Cu" "F.Paste" "F.Mask")
    (solder_mask_margin 0.0762) (tstamp b8c5956e-8c06-494f-8850-b9397c4ca0ba))
  (pad "L7" smd circle (at -2.4 0.8) (size 0.33 0.33) (layers "F.Cu" "F.Paste" "F.Mask")
    (solder_mask_margin 0.0762) (tstamp b6a6d4e1-8da9-4614-a188-fcb65fd31f24))
  (pad "L8" smd circle (at -1.6 0.8) (size 0.33 0.33) (layers "F.Cu" "F.Paste" "F.Mask")
    (solder_mask_margin 0.0762) (tstamp 7a6061cf-0e11-46af-9848-76926511bf3e))
  (pad "L9" smd circle (at -0.8 0.8) (size 0.33 0.33) (layers "F.Cu" "F.Paste" "F.Mask")
    (solder_mask_margin 0.0762) (tstamp c3f3c862-c697-458f-a0e0-55029e617cfe))
  (pad "L10" smd circle (at 0 0.8) (size 0.33 0.33) (layers "F.Cu" "F.Paste" "F.Mask")
    (solder_mask_margin 0.0762) (tstamp 0dbc4bf0-07cb-489e-8c16-969847505428))
  (pad "L11" smd circle (at 0.8 0.8) (size 0.33 0.33) (layers "F.Cu" "F.Paste" "F.Mask")
    (solder_mask_margin 0.0762) (tstamp 2509f981-4292-4255-bf41-45ea5feb58bf))
  (pad "L12" smd circle (at 1.6 0.8) (size 0.33 0.33) (layers "F.Cu" "F.Paste" "F.Mask")
    (solder_mask_margin 0.0762) (tstamp f43f84f3-6fb0-4813-a5ac-a8907dcdf9c4))
  (pad "L13" smd circle (at 2.4 0.8) (size 0.33 0.33) (layers "F.Cu" "F.Paste" "F.Mask")
    (solder_mask_margin 0.0762) (tstamp 32e7ae8b-0f4f-422c-9955-534ddfbf1fd0))
  (pad "L14" smd circle (at 3.2 0.8) (size 0.33 0.33) (layers "F.Cu" "F.Paste" "F.Mask")
    (solder_mask_margin 0.0762) (tstamp 591e5f3d-efc6-43b8-8a2a-a383a8e3091f))
  (pad "L15" smd circle (at 4 0.8) (size 0.33 0.33) (layers "F.Cu" "F.Paste" "F.Mask")
    (solder_mask_margin 0.0762) (tstamp 70adebd9-19d2-4f71-abf0-c52128d634bf))
  (pad "L16" smd circle (at 4.8 0.8) (size 0.33 0.33) (layers "F.Cu" "F.Paste" "F.Mask")
    (solder_mask_margin 0.0762) (tstamp 77a9b69a-2f10-47bd-b56a-9dae5b49099d))
  (pad "L17" smd circle (at 5.6 0.8) (size 0.33 0.33) (layers "F.Cu" "F.Paste" "F.Mask")
    (solder_mask_margin 0.0762) (tstamp 46e0a919-1bc4-4404-9d3c-02add1200d73))
  (pad "L18" smd circle (at 6.4 0.8) (size 0.33 0.33) (layers "F.Cu" "F.Paste" "F.Mask")
    (solder_mask_margin 0.0762) (tstamp 3089c0b1-b47d-4fcf-bbf0-df9daa57c355))
  (pad "L19" smd circle (at 7.2 0.8) (size 0.33 0.33) (layers "F.Cu" "F.Paste" "F.Mask")
    (solder_mask_margin 0.0762) (tstamp 2af7efb3-fa36-40d1-a911-8010b46e5f44))
  (pad "M1" smd circle (at -7.2 1.6) (size 0.33 0.33) (layers "F.Cu" "F.Paste" "F.Mask")
    (solder_mask_margin 0.0762) (tstamp 84f79912-ca48-4b9b-adf8-893a24888fc8))
  (pad "M2" smd circle (at -6.4 1.6) (size 0.33 0.33) (layers "F.Cu" "F.Paste" "F.Mask")
    (solder_mask_margin 0.0762) (tstamp 3a0a721b-5d35-41f8-a44f-2bd58adc52ab))
  (pad "M3" smd circle (at -5.6 1.6) (size 0.33 0.33) (layers "F.Cu" "F.Paste" "F.Mask")
    (solder_mask_margin 0.0762) (tstamp e30dd86b-5b48-4b03-845e-bed8d31e458f))
  (pad "M4" smd circle (at -4.8 1.6) (size 0.33 0.33) (layers "F.Cu" "F.Paste" "F.Mask")
    (solder_mask_margin 0.0762) (tstamp 51f4e188-d811-4546-9a03-b721e51cc752))
  (pad "M5" smd circle (at -4 1.6) (size 0.33 0.33) (layers "F.Cu" "F.Paste" "F.Mask")
    (solder_mask_margin 0.0762) (tstamp a040f0d3-7540-4bba-b6d2-5b0f763e4670))
  (pad "M6" smd circle (at -3.2 1.6) (size 0.33 0.33) (layers "F.Cu" "F.Paste" "F.Mask")
    (solder_mask_margin 0.0762) (tstamp 0661f807-e608-453a-96fe-6055a5c91c8b))
  (pad "M7" smd circle (at -2.4 1.6) (size 0.33 0.33) (layers "F.Cu" "F.Paste" "F.Mask")
    (solder_mask_margin 0.0762) (tstamp 54e28dbe-ea99-428b-ac79-34b077b9807c))
  (pad "M8" smd circle (at -1.6 1.6) (size 0.33 0.33) (layers "F.Cu" "F.Paste" "F.Mask")
    (solder_mask_margin 0.0762) (tstamp 7c879806-6010-42cf-b3f3-ed3a38b76fa0))
  (pad "M9" smd circle (at -0.8 1.6) (size 0.33 0.33) (layers "F.Cu" "F.Paste" "F.Mask")
    (solder_mask_margin 0.0762) (tstamp f0acdc1b-e43c-408e-927d-e91e8ea3581d))
  (pad "M10" smd circle (at 0 1.6) (size 0.33 0.33) (layers "F.Cu" "F.Paste" "F.Mask")
    (solder_mask_margin 0.0762) (tstamp 3da5da22-d956-45d5-9215-9b97ab22643b))
  (pad "M11" smd circle (at 0.8 1.6) (size 0.33 0.33) (layers "F.Cu" "F.Paste" "F.Mask")
    (solder_mask_margin 0.0762) (tstamp f857504b-fc01-433e-9061-a82544b5d18c))
  (pad "M12" smd circle (at 1.6 1.6) (size 0.33 0.33) (layers "F.Cu" "F.Paste" "F.Mask")
    (solder_mask_margin 0.0762) (tstamp 14e39e35-6466-4d59-bb21-55347de6aeed))
  (pad "M13" smd circle (at 2.4 1.6) (size 0.33 0.33) (layers "F.Cu" "F.Paste" "F.Mask")
    (solder_mask_margin 0.0762) (tstamp 97165d41-eaef-46fc-80ea-97b4d0558b9f))
  (pad "M14" smd circle (at 3.2 1.6) (size 0.33 0.33) (layers "F.Cu" "F.Paste" "F.Mask")
    (solder_mask_margin 0.0762) (tstamp fdeddf1b-6227-4f87-a9a5-5d7c1cba11f2))
  (pad "M15" smd circle (at 4 1.6) (size 0.33 0.33) (layers "F.Cu" "F.Paste" "F.Mask")
    (solder_mask_margin 0.0762) (tstamp 4be4eb8c-1b7f-445f-9bf3-d5d795b8e26d))
  (pad "M17" smd circle (at 5.6 1.6) (size 0.33 0.33) (layers "F.Cu" "F.Paste" "F.Mask")
    (solder_mask_margin 0.0762) (tstamp 36798b4b-0abf-423d-a82e-bdcb7b025baa))
  (pad "M18" smd circle (at 6.4 1.6) (size 0.33 0.33) (layers "F.Cu" "F.Paste" "F.Mask")
    (solder_mask_margin 0.0762) (tstamp 2fed49e3-e2c1-4b4c-aa7c-5d34f0dda2d3))
  (pad "M19" smd circle (at 7.2 1.6) (size 0.33 0.33) (layers "F.Cu" "F.Paste" "F.Mask")
    (solder_mask_margin 0.0762) (tstamp 0447ac43-1a48-400f-8a1b-eb15662deef4))
  (pad "N1" smd circle (at -7.2 2.4) (size 0.33 0.33) (layers "F.Cu" "F.Paste" "F.Mask")
    (solder_mask_margin 0.0762) (tstamp d4e2fb22-6132-4134-a26f-36d068ed43c8))
  (pad "N2" smd circle (at -6.4 2.4) (size 0.33 0.33) (layers "F.Cu" "F.Paste" "F.Mask")
    (solder_mask_margin 0.0762) (tstamp c704a546-0378-414a-9173-786d981b3781))
  (pad "N3" smd circle (at -5.6 2.4) (size 0.33 0.33) (layers "F.Cu" "F.Paste" "F.Mask")
    (solder_mask_margin 0.0762) (tstamp 8c681118-97ea-4a55-a648-b7ebce2c41b6))
  (pad "N4" smd circle (at -4.8 2.4) (size 0.33 0.33) (layers "F.Cu" "F.Paste" "F.Mask")
    (solder_mask_margin 0.0762) (tstamp 34e30841-e280-4e13-aa1d-117549151d41))
  (pad "N5" smd circle (at -4 2.4) (size 0.33 0.33) (layers "F.Cu" "F.Paste" "F.Mask")
    (solder_mask_margin 0.0762) (tstamp 44aceb2e-117c-4ac8-bf95-db2a5e5625ac))
  (pad "N6" smd circle (at -3.2 2.4) (size 0.33 0.33) (layers "F.Cu" "F.Paste" "F.Mask")
    (solder_mask_margin 0.0762) (tstamp bd602f8b-d579-42ba-a608-9327cfa6d04f))
  (pad "N7" smd circle (at -2.4 2.4) (size 0.33 0.33) (layers "F.Cu" "F.Paste" "F.Mask")
    (solder_mask_margin 0.0762) (tstamp f8ade483-c7a7-4263-87c1-91866e7aaaf3))
  (pad "N8" smd circle (at -1.6 2.4) (size 0.33 0.33) (layers "F.Cu" "F.Paste" "F.Mask")
    (solder_mask_margin 0.0762) (tstamp d8b18340-a2c2-41cc-b401-3c3520105854))
  (pad "N9" smd circle (at -0.8 2.4) (size 0.33 0.33) (layers "F.Cu" "F.Paste" "F.Mask")
    (solder_mask_margin 0.0762) (tstamp 5070ebd2-9414-4fe7-8f64-8f2fd71f9a53))
  (pad "N10" smd circle (at 0 2.4) (size 0.33 0.33) (layers "F.Cu" "F.Paste" "F.Mask")
    (solder_mask_margin 0.0762) (tstamp 8c7f1bb2-1f7e-49ec-8e99-bc6a9f98c6a9))
  (pad "N11" smd circle (at 0.8 2.4) (size 0.33 0.33) (layers "F.Cu" "F.Paste" "F.Mask")
    (solder_mask_margin 0.0762) (tstamp 27d13689-e6f3-4d95-8977-cad2142d64b8))
  (pad "N12" smd circle (at 1.6 2.4) (size 0.33 0.33) (layers "F.Cu" "F.Paste" "F.Mask")
    (solder_mask_margin 0.0762) (tstamp 9a64aa94-cbdb-40bb-b485-e5fab2d79413))
  (pad "N13" smd circle (at 2.4 2.4) (size 0.33 0.33) (layers "F.Cu" "F.Paste" "F.Mask")
    (solder_mask_margin 0.0762) (tstamp 2bacf28c-116b-48f0-b2b7-603d53b76e7d))
  (pad "N14" smd circle (at 3.2 2.4) (size 0.33 0.33) (layers "F.Cu" "F.Paste" "F.Mask")
    (solder_mask_margin 0.0762) (tstamp d7e7ede4-9228-4189-b674-34712529a8f6))
  (pad "N15" smd circle (at 4 2.4) (size 0.33 0.33) (layers "F.Cu" "F.Paste" "F.Mask")
    (solder_mask_margin 0.0762) (tstamp 8620f82d-fdaf-420e-ab2c-3bf6f78fe3c6))
  (pad "N16" smd circle (at 4.8 2.4) (size 0.33 0.33) (layers "F.Cu" "F.Paste" "F.Mask")
    (solder_mask_margin 0.0762) (tstamp f8005a46-10ad-4f5e-83f3-ae9ee08634c3))
  (pad "N17" smd circle (at 5.6 2.4) (size 0.33 0.33) (layers "F.Cu" "F.Paste" "F.Mask")
    (solder_mask_margin 0.0762) (tstamp 2da77703-b9e4-46be-8054-1d08557867ec))
  (pad "N18" smd circle (at 6.4 2.4) (size 0.33 0.33) (layers "F.Cu" "F.Paste" "F.Mask")
    (solder_mask_margin 0.0762) (tstamp a40cd5bb-8620-4057-b309-b76ae9d558be))
  (pad "N19" smd circle (at 7.2 2.4) (size 0.33 0.33) (layers "F.Cu" "F.Paste" "F.Mask")
    (solder_mask_margin 0.0762) (tstamp f10c0b10-efd4-47be-badc-0348245054fe))
  (pad "P1" smd circle (at -7.2 3.2) (size 0.33 0.33) (layers "F.Cu" "F.Paste" "F.Mask")
    (solder_mask_margin 0.0762) (tstamp 0bbe75fd-d41e-40ab-8a2b-eaa628c51548))
  (pad "P2" smd circle (at -6.4 3.2) (size 0.33 0.33) (layers "F.Cu" "F.Paste" "F.Mask")
    (solder_mask_margin 0.0762) (tstamp 06424005-f0dc-4bc2-8964-34fbbda3ecc5))
  (pad "P3" smd circle (at -5.6 3.2) (size 0.33 0.33) (layers "F.Cu" "F.Paste" "F.Mask")
    (solder_mask_margin 0.0762) (tstamp 28a6d62c-1141-4c6f-974c-937cee525a1f))
  (pad "P4" smd circle (at -4.8 3.2) (size 0.33 0.33) (layers "F.Cu" "F.Paste" "F.Mask")
    (solder_mask_margin 0.0762) (tstamp 7d295dd7-e974-41f9-821b-9c98a0d2b9a2))
  (pad "P5" smd circle (at -4 3.2) (size 0.33 0.33) (layers "F.Cu" "F.Paste" "F.Mask")
    (solder_mask_margin 0.0762) (tstamp 8138df37-c0a7-4bb1-8699-bab03708947b))
  (pad "P6" smd circle (at -3.2 3.2) (size 0.33 0.33) (layers "F.Cu" "F.Paste" "F.Mask")
    (solder_mask_margin 0.0762) (tstamp 667a628e-089b-4e5b-a4a8-b73f57aea0b3))
  (pad "P7" smd circle (at -2.4 3.2) (size 0.33 0.33) (layers "F.Cu" "F.Paste" "F.Mask")
    (solder_mask_margin 0.0762) (tstamp b52a894a-2bf5-4f23-8119-d216d38562fe))
  (pad "P8" smd circle (at -1.6 3.2) (size 0.33 0.33) (layers "F.Cu" "F.Paste" "F.Mask")
    (solder_mask_margin 0.0762) (tstamp 58da3237-39c6-49ed-8857-7fbb13b75014))
  (pad "P9" smd circle (at -0.8 3.2) (size 0.33 0.33) (layers "F.Cu" "F.Paste" "F.Mask")
    (solder_mask_margin 0.0762) (tstamp b3c6ced4-4c68-4e9b-8b28-64c1c952bb60))
  (pad "P10" smd circle (at 0 3.2) (size 0.33 0.33) (layers "F.Cu" "F.Paste" "F.Mask")
    (solder_mask_margin 0.0762) (tstamp 6971b2a9-aa2e-4cf5-b78a-9bd6291b632e))
  (pad "P11" smd circle (at 0.8 3.2) (size 0.33 0.33) (layers "F.Cu" "F.Paste" "F.Mask")
    (solder_mask_margin 0.0762) (tstamp 1b360fec-e6e2-460d-a7d5-888750eed856))
  (pad "P12" smd circle (at 1.6 3.2) (size 0.33 0.33) (layers "F.Cu" "F.Paste" "F.Mask")
    (solder_mask_margin 0.0762) (tstamp 3bc316bf-834a-4aa9-aa18-ea5833b198c5))
  (pad "P13" smd circle (at 2.4 3.2) (size 0.33 0.33) (layers "F.Cu" "F.Paste" "F.Mask")
    (solder_mask_margin 0.0762) (tstamp 970240c3-84fa-4411-9fc0-02abead4f011))
  (pad "P14" smd circle (at 3.2 3.2) (size 0.33 0.33) (layers "F.Cu" "F.Paste" "F.Mask")
    (solder_mask_margin 0.0762) (tstamp a3772efe-f7d9-454f-ab19-92dd56aa854d))
  (pad "P15" smd circle (at 4 3.2) (size 0.33 0.33) (layers "F.Cu" "F.Paste" "F.Mask")
    (solder_mask_margin 0.0762) (tstamp 2dd65713-7466-4439-82f7-7823e833c29d))
  (pad "P17" smd circle (at 5.6 3.2) (size 0.33 0.33) (layers "F.Cu" "F.Paste" "F.Mask")
    (solder_mask_margin 0.0762) (tstamp 254c7f84-7e9c-474a-9da0-e4d7751f2c4a))
  (pad "P18" smd circle (at 6.4 3.2) (size 0.33 0.33) (layers "F.Cu" "F.Paste" "F.Mask")
    (solder_mask_margin 0.0762) (tstamp dc92f068-c268-40aa-8801-f9e8290f50f4))
  (pad "P19" smd circle (at 7.2 3.2) (size 0.33 0.33) (layers "F.Cu" "F.Paste" "F.Mask")
    (solder_mask_margin 0.0762) (tstamp f47f1cde-4e45-4b6f-be96-97d92d41010b))
  (pad "R1" smd circle (at -7.2 4) (size 0.33 0.33) (layers "F.Cu" "F.Paste" "F.Mask")
    (solder_mask_margin 0.0762) (tstamp f8e5a1dd-0c50-4a20-83b4-8d0dbc32c2dd))
  (pad "R2" smd circle (at -6.4 4) (size 0.33 0.33) (layers "F.Cu" "F.Paste" "F.Mask")
    (solder_mask_margin 0.0762) (tstamp c5ab8a43-79d0-4c15-8afc-bcfb3162add7))
  (pad "R3" smd circle (at -5.6 4) (size 0.33 0.33) (layers "F.Cu" "F.Paste" "F.Mask")
    (solder_mask_margin 0.0762) (tstamp fce14190-29ab-4232-ba0d-40c191682485))
  (pad "R4" smd circle (at -4.8 4) (size 0.33 0.33) (layers "F.Cu" "F.Paste" "F.Mask")
    (solder_mask_margin 0.0762) (tstamp f985fef9-64dc-41e8-ab96-ea33411a33ce))
  (pad "R5" smd circle (at -4 4) (size 0.33 0.33) (layers "F.Cu" "F.Paste" "F.Mask")
    (solder_mask_margin 0.0762) (tstamp d78ada96-01b9-48d8-9988-1adc9106ba82))
  (pad "R6" smd circle (at -3.2 4) (size 0.33 0.33) (layers "F.Cu" "F.Paste" "F.Mask")
    (solder_mask_margin 0.0762) (tstamp 732d2b4d-05e5-4bc6-8edf-ddea27c122c9))
  (pad "R7" smd circle (at -2.4 4) (size 0.33 0.33) (layers "F.Cu" "F.Paste" "F.Mask")
    (solder_mask_margin 0.0762) (tstamp 9921e26a-cf9f-4de8-a5c9-b82f110b562c))
  (pad "R8" smd circle (at -1.6 4) (size 0.33 0.33) (layers "F.Cu" "F.Paste" "F.Mask")
    (solder_mask_margin 0.0762) (tstamp 4e259708-d0a7-4616-a717-3e995f427843))
  (pad "R9" smd circle (at -0.8 4) (size 0.33 0.33) (layers "F.Cu" "F.Paste" "F.Mask")
    (solder_mask_margin 0.0762) (tstamp 9d548adb-b990-4418-aaa3-8233115f5331))
  (pad "R10" smd circle (at 0 4) (size 0.33 0.33) (layers "F.Cu" "F.Paste" "F.Mask")
    (solder_mask_margin 0.0762) (tstamp 414383e9-27fa-43de-9974-d8d318075a13))
  (pad "R11" smd circle (at 0.8 4) (size 0.33 0.33) (layers "F.Cu" "F.Paste" "F.Mask")
    (solder_mask_margin 0.0762) (tstamp d997bae6-daa7-4cc5-a642-b2cad7441c68))
  (pad "R12" smd circle (at 1.6 4) (size 0.33 0.33) (layers "F.Cu" "F.Paste" "F.Mask")
    (solder_mask_margin 0.0762) (tstamp 4aedd176-fb7d-42d4-be0e-b60f9988cb15))
  (pad "R13" smd circle (at 2.4 4) (size 0.33 0.33) (layers "F.Cu" "F.Paste" "F.Mask")
    (solder_mask_margin 0.0762) (tstamp 745bd17d-11f7-46f3-8c97-a8786004d9c3))
  (pad "R14" smd circle (at 3.2 4) (size 0.33 0.33) (layers "F.Cu" "F.Paste" "F.Mask")
    (solder_mask_margin 0.0762) (tstamp f37d55ad-faec-40ab-8a60-1be28a910e22))
  (pad "R15" smd circle (at 4 4) (size 0.33 0.33) (layers "F.Cu" "F.Paste" "F.Mask")
    (solder_mask_margin 0.0762) (tstamp 6bd4175b-e812-4780-9b43-116559fb548c))
  (pad "R16" smd circle (at 4.8 4) (size 0.33 0.33) (layers "F.Cu" "F.Paste" "F.Mask")
    (solder_mask_margin 0.0762) (tstamp 7ebe0d7b-fe98-491b-8bd9-440ab4bb162b))
  (pad "R17" smd circle (at 5.6 4) (size 0.33 0.33) (layers "F.Cu" "F.Paste" "F.Mask")
    (solder_mask_margin 0.0762) (tstamp 5841e59f-30d4-4d0a-b72a-3d15679157bf))
  (pad "R18" smd circle (at 6.4 4) (size 0.33 0.33) (layers "F.Cu" "F.Paste" "F.Mask")
    (solder_mask_margin 0.0762) (tstamp 21f84e4a-4269-4ea5-b951-570a1e0f43ec))
  (pad "T1" smd circle (at -7.2 4.8) (size 0.33 0.33) (layers "F.Cu" "F.Paste" "F.Mask")
    (solder_mask_margin 0.0762) (tstamp 1d6258de-caea-47fa-8bd0-6ed90ea9119f))
  (pad "T2" smd circle (at -6.4 4.8) (size 0.33 0.33) (layers "F.Cu" "F.Paste" "F.Mask")
    (solder_mask_margin 0.0762) (tstamp ee2c538c-0954-4ad5-a1f1-46ac033088ee))
  (pad "T3" smd circle (at -5.6 4.8) (size 0.33 0.33) (layers "F.Cu" "F.Paste" "F.Mask")
    (solder_mask_margin 0.0762) (tstamp 520b87e1-451a-4559-b579-640615c48bac))
  (pad "T4" smd circle (at -4.8 4.8) (size 0.33 0.33) (layers "F.Cu" "F.Paste" "F.Mask")
    (solder_mask_margin 0.0762) (tstamp 7e16d926-59c5-4199-b199-58f19e2c80ec))
  (pad "T5" smd circle (at -4 4.8) (size 0.33 0.33) (layers "F.Cu" "F.Paste" "F.Mask")
    (solder_mask_margin 0.0762) (tstamp d8aa3815-68b5-46d8-9276-3ed3811c2a20))
  (pad "T6" smd circle (at -3.2 4.8) (size 0.33 0.33) (layers "F.Cu" "F.Paste" "F.Mask")
    (solder_mask_margin 0.0762) (tstamp b6d1e0a5-885b-48e1-af1e-d6a70e5e3e88))
  (pad "T7" smd circle (at -2.4 4.8) (size 0.33 0.33) (layers "F.Cu" "F.Paste" "F.Mask")
    (solder_mask_margin 0.0762) (tstamp ca3026dd-ac96-40fa-9b24-a24d61f19fc0))
  (pad "T8" smd circle (at -1.6 4.8) (size 0.33 0.33) (layers "F.Cu" "F.Paste" "F.Mask")
    (solder_mask_margin 0.0762) (tstamp 0c16fdfc-e67b-4848-926b-7c12d15161d5))
  (pad "T9" smd circle (at -0.8 4.8) (size 0.33 0.33) (layers "F.Cu" "F.Paste" "F.Mask")
    (solder_mask_margin 0.0762) (tstamp 85cdb7df-bc95-4643-bfa9-dd78aa0e1f48))
  (pad "T10" smd circle (at 0 4.8) (size 0.33 0.33) (layers "F.Cu" "F.Paste" "F.Mask")
    (solder_mask_margin 0.0762) (tstamp a8290893-fbe3-4dbf-8fd9-d4483a2d0837))
  (pad "T11" smd circle (at 0.8 4.8) (size 0.33 0.33) (layers "F.Cu" "F.Paste" "F.Mask")
    (solder_mask_margin 0.0762) (tstamp 3b7d987b-7e6a-41ab-9c34-bb550e863aaf))
  (pad "T12" smd circle (at 1.6 4.8) (size 0.33 0.33) (layers "F.Cu" "F.Paste" "F.Mask")
    (solder_mask_margin 0.0762) (tstamp a5ccc4cf-4855-488f-bd9d-cef3f2036eb5))
  (pad "T13" smd circle (at 2.4 4.8) (size 0.33 0.33) (layers "F.Cu" "F.Paste" "F.Mask")
    (solder_mask_margin 0.0762) (tstamp f45da403-9783-4512-953d-f4b9d380bfd1))
  (pad "T14" smd circle (at 3.2 4.8) (size 0.33 0.33) (layers "F.Cu" "F.Paste" "F.Mask")
    (solder_mask_margin 0.0762) (tstamp d3f2ef4c-fd47-4929-aa7a-9144778b22f6))
  (pad "T15" smd circle (at 4 4.8) (size 0.33 0.33) (layers "F.Cu" "F.Paste" "F.Mask")
    (solder_mask_margin 0.0762) (tstamp e189bd0b-6e93-4ace-8d3a-0e99f85a455b))
  (pad "T16" smd circle (at 4.8 4.8) (size 0.33 0.33) (layers "F.Cu" "F.Paste" "F.Mask")
    (solder_mask_margin 0.0762) (tstamp 9e2be616-d71d-49f0-b707-eaa6a7ead3a0))
  (pad "T17" smd circle (at 5.6 4.8) (size 0.33 0.33) (layers "F.Cu" "F.Paste" "F.Mask")
    (solder_mask_margin 0.0762) (tstamp 9eaee424-4d72-46d8-bba0-951c974af458))
  (pad "T18" smd circle (at 6.4 4.8) (size 0.33 0.33) (layers "F.Cu" "F.Paste" "F.Mask")
    (solder_mask_margin 0.0762) (tstamp a3dc7ca8-a02c-48b2-bf9a-743e51ecd942))
  (pad "T19" smd circle (at 7.2 4.8) (size 0.33 0.33) (layers "F.Cu" "F.Paste" "F.Mask")
    (solder_mask_margin 0.0762) (tstamp b2bd07d9-51e1-4763-90e4-e0b5512a102e))
  (pad "U1" smd circle (at -7.2 5.6) (size 0.33 0.33) (layers "F.Cu" "F.Paste" "F.Mask")
    (solder_mask_margin 0.0762) (tstamp de7a41e5-d62b-4a2e-b76c-5c15e88268c2))
  (pad "U2" smd circle (at -6.4 5.6) (size 0.33 0.33) (layers "F.Cu" "F.Paste" "F.Mask")
    (solder_mask_margin 0.0762) (tstamp 37a10726-fc04-4c1a-8dee-3fc41da8a633))
  (pad "U3" smd circle (at -5.6 5.6) (size 0.33 0.33) (layers "F.Cu" "F.Paste" "F.Mask")
    (solder_mask_margin 0.0762) (tstamp df8e8f53-e145-4a81-a739-85cd9d4e85be))
  (pad "U4" smd circle (at -4.8 5.6) (size 0.33 0.33) (layers "F.Cu" "F.Paste" "F.Mask")
    (solder_mask_margin 0.0762) (tstamp 26ccbc0e-d34b-43f5-9c11-ed281c59f5c6))
  (pad "U5" smd circle (at -4 5.6) (size 0.33 0.33) (layers "F.Cu" "F.Paste" "F.Mask")
    (solder_mask_margin 0.0762) (tstamp c847c192-ff2a-4eab-8cb3-be15c0a840a3))
  (pad "U6" smd circle (at -3.2 5.6) (size 0.33 0.33) (layers "F.Cu" "F.Paste" "F.Mask")
    (solder_mask_margin 0.0762) (tstamp c6446c95-660c-4344-a43f-3a63686a46c3))
  (pad "U7" smd circle (at -2.4 5.6) (size 0.33 0.33) (layers "F.Cu" "F.Paste" "F.Mask")
    (solder_mask_margin 0.0762) (tstamp 1446e618-a454-46c2-973f-25cf05d1a380))
  (pad "U8" smd circle (at -1.6 5.6) (size 0.33 0.33) (layers "F.Cu" "F.Paste" "F.Mask")
    (solder_mask_margin 0.0762) (tstamp d71757a2-0739-42ef-8e8e-ed1f7ccd14a3))
  (pad "U9" smd circle (at -0.8 5.6) (size 0.33 0.33) (layers "F.Cu" "F.Paste" "F.Mask")
    (solder_mask_margin 0.0762) (tstamp 690d69dc-5f8c-4c86-b55a-2f57fda621e5))
  (pad "U10" smd circle (at 0 5.6) (size 0.33 0.33) (layers "F.Cu" "F.Paste" "F.Mask")
    (solder_mask_margin 0.0762) (tstamp 6b6a224b-335c-4b2f-a4b4-9655c897469e))
  (pad "U11" smd circle (at 0.8 5.6) (size 0.33 0.33) (layers "F.Cu" "F.Paste" "F.Mask")
    (solder_mask_margin 0.0762) (tstamp 3adb1496-5ebd-4522-80e1-3088d174789e))
  (pad "U12" smd circle (at 1.6 5.6) (size 0.33 0.33) (layers "F.Cu" "F.Paste" "F.Mask")
    (solder_mask_margin 0.0762) (tstamp 4c500e84-d743-4af5-8c05-0af827f5477e))
  (pad "U13" smd circle (at 2.4 5.6) (size 0.33 0.33) (layers "F.Cu" "F.Paste" "F.Mask")
    (solder_mask_margin 0.0762) (tstamp 8a9735f5-e9fa-481e-b4ed-02f370e2af58))
  (pad "U14" smd circle (at 3.2 5.6) (size 0.33 0.33) (layers "F.Cu" "F.Paste" "F.Mask")
    (solder_mask_margin 0.0762) (tstamp 9e325986-279a-4221-b2aa-4bcb2fd07988))
  (pad "U15" smd circle (at 4 5.6) (size 0.33 0.33) (layers "F.Cu" "F.Paste" "F.Mask")
    (solder_mask_margin 0.0762) (tstamp e291b001-c003-4837-8062-d7fdd245b072))
  (pad "U16" smd circle (at 4.8 5.6) (size 0.33 0.33) (layers "F.Cu" "F.Paste" "F.Mask")
    (solder_mask_margin 0.0762) (tstamp 901e7a6e-e2fc-4e37-b858-3aa1bf7175b6))
  (pad "U17" smd circle (at 5.6 5.6) (size 0.33 0.33) (layers "F.Cu" "F.Paste" "F.Mask")
    (solder_mask_margin 0.0762) (tstamp 9e1b0536-2f5c-44c1-8eb3-4b88fb7488e4))
  (pad "U18" smd circle (at 6.4 5.6) (size 0.33 0.33) (layers "F.Cu" "F.Paste" "F.Mask")
    (solder_mask_margin 0.0762) (tstamp 7756df6b-a013-45cd-b8b8-f70316b22d36))
  (pad "U19" smd circle (at 7.2 5.6) (size 0.33 0.33) (layers "F.Cu" "F.Paste" "F.Mask")
    (solder_mask_margin 0.0762) (tstamp c8894b9d-7793-4b10-b605-a0af820708c1))
  (pad "V1" smd circle (at -7.2 6.4) (size 0.33 0.33) (layers "F.Cu" "F.Paste" "F.Mask")
    (solder_mask_margin 0.0762) (tstamp 7cb8df49-ffcd-47f7-b2cc-d6265199ae84))
  (pad "V2" smd circle (at -6.4 6.4) (size 0.33 0.33) (layers "F.Cu" "F.Paste" "F.Mask")
    (solder_mask_margin 0.0762) (tstamp 7df0cc2e-9908-437a-879b-2883a7bf5bcc))
  (pad "V3" smd circle (at -5.6 6.4) (size 0.33 0.33) (layers "F.Cu" "F.Paste" "F.Mask")
    (solder_mask_margin 0.0762) (tstamp 90a44b5b-971d-4f5f-86b3-65b0772379ae))
  (pad "V4" smd circle (at -4.8 6.4) (size 0.33 0.33) (layers "F.Cu" "F.Paste" "F.Mask")
    (solder_mask_margin 0.0762) (tstamp 78029b58-acce-43d4-8bb2-b39fcda5494e))
  (pad "V5" smd circle (at -4 6.4) (size 0.33 0.33) (layers "F.Cu" "F.Paste" "F.Mask")
    (solder_mask_margin 0.0762) (tstamp 1ace1faa-c22f-46b2-944a-3b4c667fc054))
  (pad "V6" smd circle (at -3.2 6.4) (size 0.33 0.33) (layers "F.Cu" "F.Paste" "F.Mask")
    (solder_mask_margin 0.0762) (tstamp 1c9b7beb-5778-492f-afaf-af8935489bd9))
  (pad "V7" smd circle (at -2.4 6.4) (size 0.33 0.33) (layers "F.Cu" "F.Paste" "F.Mask")
    (solder_mask_margin 0.0762) (tstamp 4fb05951-9755-49b7-a301-b4f8c0e41246))
  (pad "V8" smd circle (at -1.6 6.4) (size 0.33 0.33) (layers "F.Cu" "F.Paste" "F.Mask")
    (solder_mask_margin 0.0762) (tstamp 3389c91e-7b43-4ed9-a814-107aefbb554b))
  (pad "V9" smd circle (at -0.8 6.4) (size 0.33 0.33) (layers "F.Cu" "F.Paste" "F.Mask")
    (solder_mask_margin 0.0762) (tstamp 05c0f68d-e9d5-4fa9-b6e1-0d0fc4c72faf))
  (pad "V10" smd circle (at 0 6.4) (size 0.33 0.33) (layers "F.Cu" "F.Paste" "F.Mask")
    (solder_mask_margin 0.0762) (tstamp 3f5e6c47-6b43-4345-9f7c-6306645793ee))
  (pad "V11" smd circle (at 0.8 6.4) (size 0.33 0.33) (layers "F.Cu" "F.Paste" "F.Mask")
    (solder_mask_margin 0.0762) (tstamp 449c62c6-36b9-41c4-9734-b0a8672e3936))
  (pad "V12" smd circle (at 1.6 6.4) (size 0.33 0.33) (layers "F.Cu" "F.Paste" "F.Mask")
    (solder_mask_margin 0.0762) (tstamp 9c4445e8-2f79-4257-b09b-0794fc354a89))
  (pad "V13" smd circle (at 2.4 6.4) (size 0.33 0.33) (layers "F.Cu" "F.Paste" "F.Mask")
    (solder_mask_margin 0.0762) (tstamp 2ee094a6-b296-4f5a-ac71-665b42f8ef35))
  (pad "V14" smd circle (at 3.2 6.4) (size 0.33 0.33) (layers "F.Cu" "F.Paste" "F.Mask")
    (solder_mask_margin 0.0762) (tstamp fcd45037-00d2-473a-9092-a7efff1914e1))
  (pad "V15" smd circle (at 4 6.4) (size 0.33 0.33) (layers "F.Cu" "F.Paste" "F.Mask")
    (solder_mask_margin 0.0762) (tstamp 0e1c0f6f-9b3d-4dd0-b1e3-45fdfc5a7186))
  (pad "V16" smd circle (at 4.8 6.4) (size 0.33 0.33) (layers "F.Cu" "F.Paste" "F.Mask")
    (solder_mask_margin 0.0762) (tstamp 4dc0181e-1638-4068-9c34-c740e59b984b))
  (pad "V17" smd circle (at 5.6 6.4) (size 0.33 0.33) (layers "F.Cu" "F.Paste" "F.Mask")
    (solder_mask_margin 0.0762) (tstamp 145473db-bd60-4d70-b1bf-25659f1d6436))
  (pad "V18" smd circle (at 6.4 6.4) (size 0.33 0.33) (layers "F.Cu" "F.Paste" "F.Mask")
    (solder_mask_margin 0.0762) (tstamp ff6ac747-707b-4961-a102-563a11d935be))
  (pad "V19" smd circle (at 7.2 6.4) (size 0.33 0.33) (layers "F.Cu" "F.Paste" "F.Mask")
    (solder_mask_margin 0.0762) (tstamp 080a08bf-bfa5-4400-a569-a49d4653a2c1))
  (pad "W1" smd circle (at -7.2 7.2) (size 0.33 0.33) (layers "F.Cu" "F.Paste" "F.Mask")
    (solder_mask_margin 0.0762) (tstamp cdda3226-96bc-4ab8-ac13-6ea872800666))
  (pad "W2" smd circle (at -6.4 7.2) (size 0.33 0.33) (layers "F.Cu" "F.Paste" "F.Mask")
    (solder_mask_margin 0.0762) (tstamp e021eebb-881e-4907-b8b9-66001bee1546))
  (pad "W3" smd circle (at -5.6 7.2) (size 0.33 0.33) (layers "F.Cu" "F.Paste" "F.Mask")
    (solder_mask_margin 0.0762) (tstamp 7dbe509d-fd70-4b0f-aeb0-a2f65c405dc0))
  (pad "W4" smd circle (at -4.8 7.2) (size 0.33 0.33) (layers "F.Cu" "F.Paste" "F.Mask")
    (solder_mask_margin 0.0762) (tstamp 22f41cdf-8576-4435-9fba-f89766f2cfd3))
  (pad "W5" smd circle (at -4 7.2) (size 0.33 0.33) (layers "F.Cu" "F.Paste" "F.Mask")
    (solder_mask_margin 0.0762) (tstamp ab449727-22d4-464c-8d23-d126bb2b8106))
  (pad "W6" smd circle (at -3.2 7.2) (size 0.33 0.33) (layers "F.Cu" "F.Paste" "F.Mask")
    (solder_mask_margin 0.0762) (tstamp 2db1b103-e8e0-4bd1-aa21-0a767cb22943))
  (pad "W7" smd circle (at -2.4 7.2) (size 0.33 0.33) (layers "F.Cu" "F.Paste" "F.Mask")
    (solder_mask_margin 0.0762) (tstamp 6151e836-7894-422d-a85c-ef70bac6636e))
  (pad "W8" smd circle (at -1.6 7.2) (size 0.33 0.33) (layers "F.Cu" "F.Paste" "F.Mask")
    (solder_mask_margin 0.0762) (tstamp 333bc795-d472-4ec9-bc31-9c60eaa68ae8))
  (pad "W9" smd circle (at -0.8 7.2) (size 0.33 0.33) (layers "F.Cu" "F.Paste" "F.Mask")
    (solder_mask_margin 0.0762) (tstamp 1a3c6efd-aa88-419c-9ee6-0946c824e34a))
  (pad "W10" smd circle (at 0 7.2) (size 0.33 0.33) (layers "F.Cu" "F.Paste" "F.Mask")
    (solder_mask_margin 0.0762) (tstamp 150aa66b-131e-4778-9415-e86f96020154))
  (pad "W11" smd circle (at 0.8 7.2) (size 0.33 0.33) (layers "F.Cu" "F.Paste" "F.Mask")
    (solder_mask_margin 0.0762) (tstamp 8117a6c6-94e2-4bbe-966f-d0207bb4fe50))
  (pad "W12" smd circle (at 1.6 7.2) (size 0.33 0.33) (layers "F.Cu" "F.Paste" "F.Mask")
    (solder_mask_margin 0.0762) (tstamp 518c7ac1-4e6b-4d15-9de4-bb0f281beaed))
  (pad "W13" smd circle (at 2.4 7.2) (size 0.33 0.33) (layers "F.Cu" "F.Paste" "F.Mask")
    (solder_mask_margin 0.0762) (tstamp b71279e1-da3b-4d65-aae1-2a358961fb99))
  (pad "W14" smd circle (at 3.2 7.2) (size 0.33 0.33) (layers "F.Cu" "F.Paste" "F.Mask")
    (solder_mask_margin 0.0762) (tstamp c276ac88-b39b-4aa8-a37b-856344617097))
  (pad "W15" smd circle (at 4 7.2) (size 0.33 0.33) (layers "F.Cu" "F.Paste" "F.Mask")
    (solder_mask_margin 0.0762) (tstamp b4b6a71c-f409-4789-b894-f8d8eef489a4))
  (pad "W16" smd circle (at 4.8 7.2) (size 0.33 0.33) (layers "F.Cu" "F.Paste" "F.Mask")
    (solder_mask_margin 0.0762) (tstamp 1f5254b9-f735-4d6a-9717-07504115902d))
  (pad "W17" smd circle (at 5.6 7.2) (size 0.33 0.33) (layers "F.Cu" "F.Paste" "F.Mask")
    (solder_mask_margin 0.0762) (tstamp 742294f9-06a4-4827-9dd1-72402f4ca7ee))
  (pad "W18" smd circle (at 6.4 7.2) (size 0.33 0.33) (layers "F.Cu" "F.Paste" "F.Mask")
    (solder_mask_margin 0.0762) (tstamp 935adf6d-57a9-49de-9f02-1bd977ca9e5e))
  (pad "W19" smd circle (at 7.2 7.2) (size 0.33 0.33) (layers "F.Cu" "F.Paste" "F.Mask")
    (solder_mask_margin 0.0762) (tstamp 9c386c79-8215-45d3-aaf7-d93256453e87))
  (model "${ONEKIWI_3DMODEL_DIR}/Package_BGA.3dshapes/LFBGA354_16.0x16.0_P0.8.stp"
    (offset (xyz 0 0 0))
    (scale (xyz 1 1 1))
    (rotate (xyz 0 0 0))
  )
)
