(footprint "Relay_DPDT_29x12.6" (version 20210722) (generator pcbnew) (layer "F.Cu")
  (tedit 617563F7)
  (descr "Relay DPDT Schrack-RT2 RM5mm 16A 250V AC Form C http://www.te.com/commerce/DocumentDelivery/DDEController?Action=srchrtrv&DocNm=RT2_reflow&DocType=DS&DocLang=EN")
  (tags "Relay DPDT Schrack-RT2 RM5mm 16A 250V AC Relay")
  (attr through_hole)
  (fp_text reference "REF**" (at 0 0) (layer "F.SilkS")
    (effects (font (size 1 1) (thickness 0.15)))
    (tstamp 378fb26e-79ae-455a-a561-af1a01237dfe)
  )
  (fp_text value "Relay_DPDT_29x12.6" (at 0 16.002) (layer "F.Fab")
    (effects (font (size 1 1) (thickness 0.15)))
    (tstamp 4de16d89-1c81-4511-b0a4-a2a41836adbd)
  )
  (fp_text user "${REFERENCE}" (at 0 0 180) (layer "F.Fab")
    (effects (font (size 1 1) (thickness 0.15)))
    (tstamp f36bedae-9801-4f2b-a2dc-76d3ed1b1a35)
  )
  (fp_line (start 0.635 10.795) (end 0.635 12.7) (layer "F.SilkS") (width 0.1778) (tstamp 1b07ac86-6b68-443f-90cd-3169df2884cb))
  (fp_line (start -3.81 -10.795) (end -3.81 -9.525) (layer "F.SilkS") (width 0.1778) (tstamp 20d68ff4-402d-47e8-b3be-68be275a7984))
  (fp_line (start 0.635 12.7) (end 1.905 12.7) (layer "F.SilkS") (width 0.1778) (tstamp 2c1da15b-e353-4bb3-8677-5a97d64ccd33))
  (fp_line (start -0.635 2.54) (end -0.635 4.445) (layer "F.SilkS") (width 0.1778) (tstamp 49e6a9dc-1e69-4795-968f-529fe3b738e6))
  (fp_line (start -1.905 2.54) (end -0.635 2.54) (layer "F.SilkS") (width 0.1778) (tstamp 6411356b-a1fc-4d7d-8cf2-52b56651f3d0))
  (fp_line (start -1.27 -8.255) (end 0 -10.795) (layer "F.SilkS") (width 0.1778) (tstamp 69872379-227b-4b77-a72f-64313b010727))
  (fp_line (start 1.905 7.62) (end 0.635 5.715) (layer "F.SilkS") (width 0.1778) (tstamp 83357e29-e48a-475d-aa10-e6c3d5d0b5fc))
  (fp_line (start 0.635 2.54) (end 1.905 2.54) (layer "F.SilkS") (width 0.1778) (tstamp 88f7f335-7b13-4245-99e3-dcb1fede4b74))
  (fp_line (start -1.905 12.7) (end -0.635 12.7) (layer "F.SilkS") (width 0.1778) (tstamp 96d269ce-78db-4b25-8412-48e3937a19af))
  (fp_line (start 3.81 -10.795) (end 3.81 -9.525) (layer "F.SilkS") (width 0.1778) (tstamp 991a4c3a-0ab9-41d9-b00e-ecac4d1542f4))
  (fp_line (start -0.635 10.795) (end -0.635 12.7) (layer "F.SilkS") (width 0.1778) (tstamp acd1ec78-e8ac-424a-b439-9d542ae29940))
  (fp_line (start -3.81 -9.525) (end -2.54 -9.525) (layer "F.SilkS") (width 0.1778) (tstamp c2bff8aa-405a-4049-a449-2438b44d100d))
  (fp_line (start 3.81 -9.525) (end 2.54 -9.525) (layer "F.SilkS") (width 0.1778) (tstamp d0f2d460-c1a6-4f76-beaa-61262b31567e))
  (fp_line (start 0.635 2.54) (end 0.635 4.445) (layer "F.SilkS") (width 0.1778) (tstamp d5ef24e4-8b16-4c10-9889-fab882524e1a))
  (fp_line (start -1.905 7.62) (end -0.635 5.715) (layer "F.SilkS") (width 0.1778) (tstamp e4aa63ed-e178-4802-9112-59dc6c2532ad))
  (fp_rect (start -2.54 -10.795) (end 2.54 -8.255) (layer "F.SilkS") (width 0.1778) (fill none) (tstamp 4cfd5709-42f2-4094-9b51-8276ffc0a250))
  (fp_rect (start -6.35 -14.605) (end 6.35 14.605) (layer "F.SilkS") (width 0.1778) (fill none) (tstamp de585744-267e-4a0d-8297-bd00f102d0af))
  (fp_rect (start -6.604 -14.732) (end 6.604 15.24) (layer "F.CrtYd") (width 0.0254) (fill none) (tstamp 804a905b-282b-437e-9e69-d7a376662a0b))
  (fp_rect (start -6.5 -14.5) (end 6.5 15) (layer "F.Fab") (width 0.1) (fill none) (tstamp 092bdced-bddf-4604-a89c-a8b7830a8d52))
  (pad "CO1" thru_hole oval locked (at -3.81 7.62 90) (size 2.032 3.048) (drill 1.27) (layers *.Cu *.Mask) (tstamp 4da83fc4-eebf-4059-a5c9-eae5ea6442e2))
  (pad "CO2" thru_hole oval locked (at 3.81 7.62 90) (size 2.032 3.048) (drill 1.27) (layers *.Cu *.Mask) (tstamp 21f2d303-72ec-4684-a6eb-df5c48b2ca47))
  (pad "N" thru_hole oval locked (at 3.81 -12.7) (size 3.048 2.032) (drill 1.27) (layers *.Cu *.Mask) (tstamp e9053811-3415-4ec9-bcf3-fea595c3f820))
  (pad "NC1" thru_hole oval locked (at -3.81 2.54 90) (size 2.032 3.048) (drill 1.27) (layers *.Cu *.Mask) (tstamp 84d619a8-ce92-4078-8464-5e4e0fbb091f))
  (pad "NC2" thru_hole oval locked (at 3.81 2.54 90) (size 2.032 3.048) (drill 1.27) (layers *.Cu *.Mask) (tstamp 3329b024-9d60-4deb-9c1b-7995d84b7b07))
  (pad "NO1" thru_hole oval locked (at -3.81 12.7 90) (size 2.032 3.048) (drill 1.27) (layers *.Cu *.Mask) (tstamp 7b05901a-5f00-4276-b7b9-74f97b77f10b))
  (pad "NO2" thru_hole oval locked (at 3.81 12.7 90) (size 2.032 3.048) (drill 1.27) (layers *.Cu *.Mask) (tstamp a7c34b5a-02f2-4374-8571-04a2bdc9b15a))
  (pad "P" thru_hole rect locked (at -3.81 -12.7) (size 3.048 2.032) (drill 1.27) (layers *.Cu *.Mask) (tstamp d6b5cc2d-e375-41a7-b564-ed77e796152e))
  (model "${KICAD6_3DMODEL_DIR}/Relay_THT.3dshapes/Relay_DPDT_Schrack-RT2-FormC_RM5mm.wrl"
    (offset (xyz -3.81 12.7 0))
    (scale (xyz 1 1 1))
    (rotate (xyz 0 0 90))
  )
)
