(footprint "XH_P2.54_14" (version 20210722) (generator pcbnew) (layer "F.Cu")
  (tedit 6176B99B)
  (descr "JST XH series connector, B20B-XH-A (http://www.jst-mfg.com/product/pdf/eng/eXH.pdf), generated with kicad-footprint-generator")
  (tags "connector JST XH side entry")
  (attr through_hole)
  (fp_text reference "REF**" (at 0 0) (layer "F.SilkS")
    (effects (font (size 1 1) (thickness 0.15)))
    (tstamp 10c648c1-0f63-4a30-a346-3f54f933636e)
  )
  (fp_text value "XH_P2.54_14" (at 0 0) (layer "F.Fab")
    (effects (font (size 1 1) (thickness 0.15)))
    (tstamp 3f955aef-f5d7-441a-a3c0-33a3ab68a583)
  )
  (fp_text user "${REFERENCE}" (at 0 0) (layer "F.Fab")
    (effects (font (size 1 1) (thickness 0.15)))
    (tstamp 72e5a27c-406d-49f4-ae81-59458c021d5a)
  )
  (fp_line (start 19.05 -2.54) (end 19.05 3.556) (layer "F.SilkS") (width 0.1778) (tstamp 34e5e6d7-b8c5-4755-9298-255045873621))
  (fp_line (start -19.05 -0.254) (end -18.288 -0.254) (layer "F.SilkS") (width 0.1778) (tstamp 55107ef3-8803-40e6-8c5d-2979f5229243))
  (fp_line (start -19.304 -1.524) (end -19.304 -2.794) (layer "F.SilkS") (width 0.1778) (tstamp 75e5b7f8-f879-4208-afbc-95b703b26fb0))
  (fp_line (start -19.05 3.556) (end 19.05 3.556) (layer "F.SilkS") (width 0.1778) (tstamp 86797c65-78dc-4d74-81c4-0d9d5d5d0770))
  (fp_line (start -19.05 -2.54) (end -19.05 3.556) (layer "F.SilkS") (width 0.1778) (tstamp 8865dff0-8357-4a3a-9601-192185172a46))
  (fp_line (start 18.288 -0.254) (end 18.288 2.794) (layer "F.SilkS") (width 0.1778) (tstamp 8c3d8850-7277-4612-a914-451fa7d55fa1))
  (fp_line (start -18.288 2.794) (end 18.288 2.794) (layer "F.SilkS") (width 0.1778) (tstamp 9653c1bb-53dd-4029-ac97-0d60c5d076b4))
  (fp_line (start 18.288 -0.254) (end 19.05 -0.254) (layer "F.SilkS") (width 0.1778) (tstamp c76a3ca1-d3cd-445d-b955-b46acb2d8e6b))
  (fp_line (start -18.288 -0.254) (end -18.288 2.794) (layer "F.SilkS") (width 0.1778) (tstamp d008284e-4a81-486e-a57d-b2347dadfdc5))
  (fp_line (start -19.304 -2.794) (end -18.034 -2.794) (layer "F.SilkS") (width 0.1778) (tstamp e87a3add-04a7-423f-b3df-b0c458c9db25))
  (fp_rect (start -15.748 -2.54) (end 15.748 -1.778) (layer "F.SilkS") (width 0.1778) (fill none) (tstamp 28424b42-294b-45fc-bfd1-df3a4534806b))
  (fp_rect (start 17.272 -2.54) (end 19.05 -1.778) (layer "F.SilkS") (width 0.1778) (fill none) (tstamp a4ece42f-76d6-4afa-8fc2-96069aa74009))
  (fp_rect (start -17.272 -1.778) (end -19.05 -2.54) (layer "F.SilkS") (width 0.1778) (fill none) (tstamp d63e88b4-d0e5-4823-be7c-78abbd46c3bc))
  (fp_rect (start -19.558 -3.048) (end 19.558 4.064) (layer "F.CrtYd") (width 0.0254) (fill none) (tstamp 3cc72e51-d2b3-483a-926e-721b436642ab))
  (fp_line (start -17.018 -2.54) (end -16.51 -2.032) (layer "F.Fab") (width 0.1) (tstamp a02b4f43-19a6-4883-a656-0a5e41d1ff00))
  (fp_line (start -16.002 -2.54) (end -16.51 -2.032) (layer "F.Fab") (width 0.1) (tstamp a7f3c3d3-d994-438a-8972-3d447c8206d8))
  (fp_rect (start -19.05 -2.54) (end 19.05 3.556) (layer "F.Fab") (width 0.1) (fill none) (tstamp d72051c8-6c96-40fb-ad53-60d77a668153))
  (pad "1" thru_hole roundrect locked (at -16.51 0) (size 1.778 2.032) (drill 1.016) (layers *.Cu *.Mask) (roundrect_rratio 0.15) (tstamp deff38ea-8256-47c4-a5c3-a40cee10f838))
  (pad "2" thru_hole oval locked (at -13.97 0) (size 1.778 2.032) (drill 1.016) (layers *.Cu *.Mask) (tstamp fa8aaf22-443d-4655-b154-48bb2213a3f0))
  (pad "3" thru_hole oval locked (at -11.43 0) (size 1.778 2.032) (drill 1.016) (layers *.Cu *.Mask) (tstamp 91f661ea-79c1-46ab-ba22-bf5e871ab627))
  (pad "4" thru_hole oval (at -8.89 0) (size 1.778 2.032) (drill 1.016) (layers *.Cu *.Mask) (tstamp 7d97478d-61fb-4989-88ae-627f121dcc18))
  (pad "5" thru_hole oval (at -6.35 0) (size 1.778 2.032) (drill 1.016) (layers *.Cu *.Mask) (tstamp 73fafc29-9441-4df2-8453-23bf233943df))
  (pad "6" thru_hole oval (at -3.81 0) (size 1.778 2.032) (drill 1.016) (layers *.Cu *.Mask) (tstamp 7e835bd5-eac6-4fcd-a222-7c8a148b3840))
  (pad "7" thru_hole oval (at -1.27 0) (size 1.778 2.032) (drill 1.016) (layers *.Cu *.Mask) (tstamp 50f38b97-b7ab-4b0e-9907-8c8c9725edb5))
  (pad "8" thru_hole oval (at 1.27 0) (size 1.778 2.032) (drill 1.016) (layers *.Cu *.Mask) (tstamp c4c7b8ee-6167-47e9-8e0a-a16094ad6d6b))
  (pad "9" thru_hole oval (at 3.81 0) (size 1.778 2.032) (drill 1.016) (layers *.Cu *.Mask) (tstamp fa3557ab-2e58-4191-aaaa-c4a30ad95e0e))
  (pad "10" thru_hole oval (at 6.35 0) (size 1.778 2.032) (drill 1.016) (layers *.Cu *.Mask) (tstamp 3972ecad-129c-487a-95d2-4b5c667ca721))
  (pad "11" thru_hole oval (at 8.89 0) (size 1.778 2.032) (drill 1.016) (layers *.Cu *.Mask) (tstamp 69f5b226-2eeb-45f2-ad73-a34b03ee32d9))
  (pad "12" thru_hole oval (at 11.43 0) (size 1.778 2.032) (drill 1.016) (layers *.Cu *.Mask) (tstamp 6619720a-6d30-4b9e-896c-b959c3a648f6))
  (pad "13" thru_hole oval (at 13.97 0) (size 1.778 2.032) (drill 1.016) (layers *.Cu *.Mask) (tstamp 04723740-957f-41cd-ab31-144e0a34fbfd))
  (pad "14" thru_hole oval (at 16.51 0) (size 1.778 2.032) (drill 1.016) (layers *.Cu *.Mask) (tstamp e7456933-1c6f-421a-b9cd-9c5de001d718))
)
