(footprint "TestPoint_C25" (version 20211014) (generator pcbnew)
  (layer "F.Cu")
  (tedit 608F901E)
  (descr "SMD pad as test Point, diameter 1.0mm")
  (tags "test point SMD pad")
  (attr exclude_from_pos_files exclude_from_bom)
  (fp_text reference "REF**" (at 0 -1.448) (layer "F.SilkS")
    (effects (font (size 1 1) (thickness 0.15)))
    (tstamp e00ce5f1-2fe0-4dad-896b-0b1f650bc82c)
  )
  (fp_text value "TestPoint_C25" (at 0 1.55) (layer "F.Fab")
    (effects (font (size 1 1) (thickness 0.15)))
    (tstamp eaba4890-c84f-43fa-819f-6303f84130aa)
  )
  (fp_text user "${REFERENCE}" (at 0 -1.45) (layer "F.Fab")
    (effects (font (size 1 1) (thickness 0.15)))
    (tstamp fcc6a84e-7846-46b8-8155-b4c5f2bd3cf3)
  )
  (fp_circle (center 0 0) (end 0.381 0) (layer "F.SilkS") (width 0.12) (fill none) (tstamp 0c26a5f2-8f03-460a-b5a1-926252385431))
  (fp_circle (center 0 0) (end 0.381 0) (layer "F.CrtYd") (width 0.0254) (fill none) (tstamp aeee29fd-6929-4a24-a9c4-0f62708516b1))
  (pad "1" smd circle (at 0 0) (size 0.635 0.635) (layers "F.Cu" "F.Mask") (tstamp 56f896d4-4d9e-4508-88b4-21e5dd6de2db))
)
