(footprint "QFN32_5x5_P0.5_EP3.6x3.6" (version 20210722) (generator pcbnew) (layer "F.Cu")
  (tedit 617562B1)
  (descr "QFN, 32 Pin (http://infocenter.nordicsemi.com/pdf/nRF52810_PS_v1.1.pdf#page=468), generated with kicad-footprint-generator ipc_noLead_generator.py")
  (tags "QFN NoLead")
  (attr smd)
  (fp_text reference "REF**" (at 0 0) (layer "F.SilkS")
    (effects (font (size 1.016 1.016) (thickness 0.1778)))
    (tstamp 4e21ea82-a22b-4e42-b68e-02aec5af1645)
  )
  (fp_text value "QFN32_5x5_P0.5_EP3.6x3.6" (at 0 3.8) (layer "F.Fab")
    (effects (font (size 1 1) (thickness 0.15)))
    (tstamp eb04262c-3732-40e4-a1c7-12d565d03f7d)
  )
  (fp_text user "${REFERENCE}" (at 0 0) (layer "F.Fab")
    (effects (font (size 1 1) (thickness 0.15)))
    (tstamp fffe4222-cf9a-4d0b-9f46-ea13a1d08f54)
  )
  (fp_line (start 2.54 -2.032) (end 2.54 -2.54) (layer "F.SilkS") (width 0.1778) (tstamp 286752c7-74ff-46db-8c3c-144068115158))
  (fp_line (start 2.54 2.54) (end 2.032 2.54) (layer "F.SilkS") (width 0.1778) (tstamp 6363f151-e53b-47ea-a992-d912ef20ef1d))
  (fp_line (start -2.032 -2.54) (end -2.286 -2.54) (layer "F.SilkS") (width 0.1778) (tstamp 6dc154b2-8a78-4e18-853b-0e3cbb49b351))
  (fp_line (start -2.54 -2.286) (end -2.286 -2.54) (layer "F.SilkS") (width 0.1778) (tstamp 77bc40ee-4955-4fd5-b088-1e4405f460a2))
  (fp_line (start -2.54 2.54) (end -2.54 2.032) (layer "F.SilkS") (width 0.1778) (tstamp aa6f0100-a113-42bb-9370-8ccb2783cc99))
  (fp_line (start -2.032 2.54) (end -2.54 2.54) (layer "F.SilkS") (width 0.1778) (tstamp cf883388-df57-4838-8044-2d299ac4807e))
  (fp_line (start 2.54 2.032) (end 2.54 2.54) (layer "F.SilkS") (width 0.1778) (tstamp d611b19d-e0dd-482c-9c2e-9903968f84f0))
  (fp_line (start -2.54 -2.032) (end -2.54 -2.286) (layer "F.SilkS") (width 0.1778) (tstamp ee445d8d-cdd3-4ad0-a5a1-c4d9af450094))
  (fp_line (start 2.032 -2.54) (end 2.54 -2.54) (layer "F.SilkS") (width 0.1778) (tstamp fd75d7cf-06f3-4e00-b957-68966b3e7b6e))
  (fp_poly (pts
      (xy -3.302 -1.778)
      (xy -3.81 -1.27)
      (xy -3.81 -2.286)
    ) (layer "F.SilkS") (width 0.1) (fill solid) (tstamp 0eccd7e4-03d1-4140-91d6-a7e8346d31c7))
  (fp_rect (start -3.302 -3.302) (end 3.302 3.302) (layer "F.CrtYd") (width 0.0254) (fill none) (tstamp 8ca68631-ffa8-4452-86c2-cffd19be7192))
  (fp_line (start -2.54 -2.032) (end -2.54 2.54) (layer "F.Fab") (width 0.1) (tstamp 1549d965-1aa8-4eec-bd5a-4b195faed7b2))
  (fp_line (start 2.54 2.54) (end 2.54 -2.54) (layer "F.Fab") (width 0.1) (tstamp 8314bd74-ba4c-403c-8127-92cc8b9922e6))
  (fp_line (start -2.032 -2.54) (end -2.54 -2.032) (layer "F.Fab") (width 0.1) (tstamp a2c4ec8c-420f-46fe-a9c5-f5be114f164e))
  (fp_line (start 2.54 -2.54) (end -2.032 -2.54) (layer "F.Fab") (width 0.1) (tstamp d169d34b-7a34-4a53-995f-b6d7db820251))
  (fp_line (start -2.54 2.54) (end 2.54 2.54) (layer "F.Fab") (width 0.1) (tstamp efcbc5c3-c782-4eb0-b547-e4fd37f12fd5))
  (pad "1" smd roundrect locked (at -2.54 -1.75) (size 1.016 0.254) (layers "F.Cu" "F.Paste" "F.Mask") (roundrect_rratio 0.25)
    (solder_mask_margin 0.0762) (tstamp 173a14fe-251d-4a2b-924e-612cac1ddd64))
  (pad "2" smd roundrect locked (at -2.54 -1.25) (size 1.016 0.254) (layers "F.Cu" "F.Paste" "F.Mask") (roundrect_rratio 0.25)
    (solder_mask_margin 0.0762) (tstamp 6771824f-5a79-4427-8493-a39af9bde0d7))
  (pad "3" smd roundrect locked (at -2.54 -0.75) (size 1.016 0.254) (layers "F.Cu" "F.Paste" "F.Mask") (roundrect_rratio 0.25)
    (solder_mask_margin 0.0762) (tstamp 0ffbb829-8258-4011-b8b8-398279022f22))
  (pad "4" smd roundrect locked (at -2.54 -0.25) (size 1.016 0.254) (layers "F.Cu" "F.Paste" "F.Mask") (roundrect_rratio 0.25)
    (solder_mask_margin 0.0762) (tstamp e6c5214c-71fe-4922-913a-2bae0a5c81e5))
  (pad "5" smd roundrect locked (at -2.54 0.25) (size 1.016 0.254) (layers "F.Cu" "F.Paste" "F.Mask") (roundrect_rratio 0.25)
    (solder_mask_margin 0.0762) (tstamp 387cd2d0-7873-4bbf-ba0a-d8e57a9e7256))
  (pad "6" smd roundrect locked (at -2.54 0.75) (size 1.016 0.254) (layers "F.Cu" "F.Paste" "F.Mask") (roundrect_rratio 0.25)
    (solder_mask_margin 0.0762) (tstamp e9cc495a-298a-492d-b620-08c1c0db76a4))
  (pad "7" smd roundrect locked (at -2.54 1.25) (size 1.016 0.254) (layers "F.Cu" "F.Paste" "F.Mask") (roundrect_rratio 0.25)
    (solder_mask_margin 0.0762) (tstamp 27fd5fd3-0f85-4ff5-8825-5b8fb19b9958))
  (pad "8" smd roundrect locked (at -2.54 1.75) (size 1.016 0.254) (layers "F.Cu" "F.Paste" "F.Mask") (roundrect_rratio 0.25)
    (solder_mask_margin 0.0762) (tstamp f34b2de3-2d38-4e0e-8fe3-56a1c1e23302))
  (pad "9" smd roundrect locked (at -1.75 2.54) (size 0.254 1.016) (layers "F.Cu" "F.Paste" "F.Mask") (roundrect_rratio 0.25)
    (solder_mask_margin 0.0762) (tstamp 119fe693-f33b-452b-8bdf-42f7976f86c4))
  (pad "10" smd roundrect locked (at -1.25 2.54) (size 0.254 1.016) (layers "F.Cu" "F.Paste" "F.Mask") (roundrect_rratio 0.25)
    (solder_mask_margin 0.0762) (tstamp 07155477-aa5c-4661-9e89-05940e17d046))
  (pad "11" smd roundrect locked (at -0.75 2.54) (size 0.254 1.016) (layers "F.Cu" "F.Paste" "F.Mask") (roundrect_rratio 0.25)
    (solder_mask_margin 0.0762) (tstamp 25bbd8fe-cdf5-42fc-a406-a02d52f71760))
  (pad "12" smd roundrect locked (at -0.25 2.54) (size 0.254 1.016) (layers "F.Cu" "F.Paste" "F.Mask") (roundrect_rratio 0.25)
    (solder_mask_margin 0.0762) (tstamp ee9d6cf7-873c-4a43-b1a1-96c08e9538ee))
  (pad "13" smd roundrect locked (at 0.25 2.54) (size 0.254 1.016) (layers "F.Cu" "F.Paste" "F.Mask") (roundrect_rratio 0.25)
    (solder_mask_margin 0.0762) (tstamp 89042744-4cc9-4fab-b0a2-7e914e767514))
  (pad "14" smd roundrect locked (at 0.75 2.54) (size 0.254 1.016) (layers "F.Cu" "F.Paste" "F.Mask") (roundrect_rratio 0.25)
    (solder_mask_margin 0.0762) (tstamp 2c563405-964d-46e1-ab17-4bd63603c2c7))
  (pad "15" smd roundrect locked (at 1.25 2.54) (size 0.254 1.016) (layers "F.Cu" "F.Paste" "F.Mask") (roundrect_rratio 0.25)
    (solder_mask_margin 0.0762) (tstamp e1e5421c-5995-4b4b-92b5-86dcdbd165d6))
  (pad "16" smd roundrect locked (at 1.75 2.54) (size 0.254 1.016) (layers "F.Cu" "F.Paste" "F.Mask") (roundrect_rratio 0.25)
    (solder_mask_margin 0.0762) (tstamp 095dc0f1-d82a-4b96-b1c9-5f328ec2435a))
  (pad "17" smd roundrect locked (at 2.54 1.75) (size 1.016 0.254) (layers "F.Cu" "F.Paste" "F.Mask") (roundrect_rratio 0.25)
    (solder_mask_margin 0.0762) (tstamp 159c0a6a-b101-4e3e-a02f-e25fe1957595))
  (pad "18" smd roundrect locked (at 2.54 1.25) (size 1.016 0.254) (layers "F.Cu" "F.Paste" "F.Mask") (roundrect_rratio 0.25)
    (solder_mask_margin 0.0762) (tstamp ee0bf083-8133-4f0c-b6c6-2fae0bb709d8))
  (pad "19" smd roundrect locked (at 2.54 0.75) (size 1.016 0.254) (layers "F.Cu" "F.Paste" "F.Mask") (roundrect_rratio 0.25)
    (solder_mask_margin 0.0762) (tstamp b1ec7153-c89e-4671-91e2-024180774e06))
  (pad "20" smd roundrect locked (at 2.54 0.25) (size 1.016 0.254) (layers "F.Cu" "F.Paste" "F.Mask") (roundrect_rratio 0.25)
    (solder_mask_margin 0.0762) (tstamp c354a630-3101-4d3b-9a25-eca353b7de74))
  (pad "21" smd roundrect locked (at 2.54 -0.25) (size 1.016 0.254) (layers "F.Cu" "F.Paste" "F.Mask") (roundrect_rratio 0.25)
    (solder_mask_margin 0.0762) (tstamp f9e54ca8-b9cb-4426-b2e8-a349885e8f7f))
  (pad "22" smd roundrect locked (at 2.54 -0.75) (size 1.016 0.254) (layers "F.Cu" "F.Paste" "F.Mask") (roundrect_rratio 0.25)
    (solder_mask_margin 0.0762) (tstamp 39bc1f51-b96d-4944-8dc0-7f33af424855))
  (pad "23" smd roundrect locked (at 2.54 -1.25) (size 1.016 0.254) (layers "F.Cu" "F.Paste" "F.Mask") (roundrect_rratio 0.25)
    (solder_mask_margin 0.0762) (tstamp 83d1efbc-f850-42e4-ae52-aeab3737bf59))
  (pad "24" smd roundrect locked (at 2.54 -1.75) (size 1.016 0.254) (layers "F.Cu" "F.Paste" "F.Mask") (roundrect_rratio 0.25)
    (solder_mask_margin 0.0762) (tstamp a9da6eb8-f9c7-44fa-a2a8-b2228e35120d))
  (pad "25" smd roundrect locked (at 1.75 -2.54) (size 0.254 1.016) (layers "F.Cu" "F.Paste" "F.Mask") (roundrect_rratio 0.25)
    (solder_mask_margin 0.0762) (tstamp 9f73ccd1-e6b1-486b-b1a7-0c8532454417))
  (pad "26" smd roundrect locked (at 1.25 -2.54) (size 0.254 1.016) (layers "F.Cu" "F.Paste" "F.Mask") (roundrect_rratio 0.25)
    (solder_mask_margin 0.0762) (tstamp aa552a93-4c9f-4bf1-9872-360b13d96a1d))
  (pad "27" smd roundrect locked (at 0.75 -2.54) (size 0.254 1.016) (layers "F.Cu" "F.Paste" "F.Mask") (roundrect_rratio 0.25)
    (solder_mask_margin 0.0762) (tstamp 19dc4598-2544-4efe-a655-cdc5e57a5fc5))
  (pad "28" smd roundrect locked (at 0.25 -2.54) (size 0.254 1.016) (layers "F.Cu" "F.Paste" "F.Mask") (roundrect_rratio 0.25)
    (solder_mask_margin 0.0762) (tstamp 9560e6fc-b3a4-43e8-b53a-b8de40f8a055))
  (pad "29" smd roundrect locked (at -0.25 -2.54) (size 0.254 1.016) (layers "F.Cu" "F.Paste" "F.Mask") (roundrect_rratio 0.25)
    (solder_mask_margin 0.0762) (tstamp 3f759d00-5e63-489c-87cf-a1a73fe4ff83))
  (pad "30" smd roundrect locked (at -0.75 -2.54) (size 0.254 1.016) (layers "F.Cu" "F.Paste" "F.Mask") (roundrect_rratio 0.25)
    (solder_mask_margin 0.0762) (tstamp bf6b8c61-ff4d-4bc9-833c-86b09d7cd4b5))
  (pad "31" smd roundrect locked (at -1.25 -2.54) (size 0.254 1.016) (layers "F.Cu" "F.Paste" "F.Mask") (roundrect_rratio 0.25)
    (solder_mask_margin 0.0762) (tstamp c5c01501-6542-433d-ae34-5e319d95f099))
  (pad "32" smd roundrect locked (at -1.75 -2.54) (size 0.254 1.016) (layers "F.Cu" "F.Paste" "F.Mask") (roundrect_rratio 0.25)
    (solder_mask_margin 0.0762) (tstamp 9b6e6cc1-fde9-4f51-a560-89010b379a8f))
  (pad "33" smd rect locked (at 0 1.25) (size 1.016 1.016) (layers "F.Cu" "F.Paste" "F.Mask")
    (solder_mask_margin 0.0762) (tstamp 01a04b12-844d-4966-86b2-56d8bb9eeaea))
  (pad "33" smd rect locked (at 1.27 -1.27) (size 1.016 1.016) (layers "F.Cu" "F.Paste" "F.Mask")
    (solder_mask_margin 0.0762) (tstamp 17f88d26-fddc-417d-ad79-9cd913ff43c2))
  (pad "33" thru_hole circle locked (at 0 0) (size 0.635 0.635) (drill 0.254) (layers *.Cu) (tstamp 39ee3dfc-2118-48d7-88f7-09e9b5b36679))
  (pad "33" thru_hole circle locked (at 0 1.25) (size 0.635 0.635) (drill 0.254) (layers *.Cu) (tstamp 7a88904d-0a3a-490f-a8e6-7cde0399b35c))
  (pad "33" thru_hole circle locked (at 1.27 -1.27) (size 0.635 0.635) (drill 0.254) (layers *.Cu) (tstamp 8e7deefd-95de-42b4-8742-3f127578bbc5))
  (pad "33" thru_hole circle locked (at 1.27 1.27) (size 0.635 0.635) (drill 0.254) (layers *.Cu) (tstamp 8f0e9bcc-37f0-4253-9643-b3582e889cd8))
  (pad "33" smd rect locked (at -1.27 1.27) (size 1.016 1.016) (layers "F.Cu" "F.Paste" "F.Mask")
    (solder_mask_margin 0.0762) (tstamp 9381b207-54b9-40f6-99aa-92ec9a509027))
  (pad "33" thru_hole circle locked (at -1.27 0) (size 0.635 0.635) (drill 0.254) (layers *.Cu) (tstamp 971df1da-faaf-4361-827d-165cede1d577))
  (pad "33" smd rect locked (at 1.27 0) (size 1.016 1.016) (layers "F.Cu" "F.Paste" "F.Mask")
    (solder_mask_margin 0.0762) (tstamp 9f4a21e2-4f28-4a6d-a55a-110a21e818a9))
  (pad "33" smd rect locked (at -1.27 -1.27) (size 1.016 1.016) (layers "F.Cu" "F.Paste" "F.Mask")
    (solder_mask_margin 0.0762) (tstamp 9f98fc10-6b19-47ff-9af6-b926ee61dac5))
  (pad "33" smd rect locked (at 1.27 1.27) (size 1.016 1.016) (layers "F.Cu" "F.Paste" "F.Mask")
    (solder_mask_margin 0.0762) (tstamp a5544db0-8da8-4529-be56-5202c20cdaf0))
  (pad "33" smd rect locked (at 0 0) (size 3.302 3.302) (layers "B.Cu") (tstamp a55d2649-2c94-4a10-ab10-14b81583b276))
  (pad "33" thru_hole circle locked (at -1.27 1.27) (size 0.635 0.635) (drill 0.254) (layers *.Cu) (tstamp b0e20c9b-0fdc-4f19-866c-cfca41192fe2))
  (pad "33" thru_hole circle locked (at 0 -1.27) (size 0.635 0.635) (drill 0.254) (layers *.Cu) (tstamp b922bd69-a3e9-430c-a397-bf20ca352835))
  (pad "33" thru_hole circle locked (at -1.27 -1.27) (size 0.635 0.635) (drill 0.254) (layers *.Cu) (tstamp c2dbaf97-4bfc-4676-b2fe-d066055264e8))
  (pad "33" smd rect locked (at 0 -1.27) (size 1.016 1.016) (layers "F.Cu" "F.Paste" "F.Mask")
    (solder_mask_margin 0.0762) (tstamp c4f39efe-ea7d-4f16-92d7-5fa1d95f1735))
  (pad "33" smd rect locked (at -1.27 0) (size 1.016 1.016) (layers "F.Cu" "F.Paste" "F.Mask")
    (solder_mask_margin 0.0762) (tstamp c682eb99-97b1-4b69-819c-4b155fc013a8))
  (pad "33" smd rect locked (at 0 0) (size 1.016 1.016) (layers "F.Cu" "F.Paste" "F.Mask")
    (solder_mask_margin 0.0762) (tstamp d81283c5-75a1-48be-ac2d-e92e4934a35b))
  (pad "33" thru_hole circle locked (at 1.27 0) (size 0.635 0.635) (drill 0.254) (layers *.Cu) (tstamp eee057ea-669b-4aa4-9803-473b339a8bd7))
  (model "${KICAD6_3DMODEL_DIR}/Package_DFN_QFN.3dshapes/QFN-32-1EP_5x5mm_P0.5mm_EP3.6x3.6mm.wrl"
    (offset (xyz 0 0 0))
    (scale (xyz 1 1 1))
    (rotate (xyz 0 0 0))
  )
)
