(footprint "IDC_P2.54_2x8" (version 20210722) (generator pcbnew) (layer "F.Cu")
  (tedit 6176BEFD)
  (descr "Through hole IDC box header, 2x10, 2.54mm pitch, DIN 41651 / IEC 60603-13, double rows, https://docs.google.com/spreadsheets/d/16SsEcesNF15N3Lb4niX7dcUr-NY5_MFPQhobNuNppn4/edit#gid=0")
  (tags "Through hole vertical IDC box header THT 2x10 2.54mm double row")
  (attr through_hole)
  (fp_text reference "REF**" (at 0 0 90) (layer "F.SilkS")
    (effects (font (size 1.016 1.016) (thickness 0.1778)))
    (tstamp c01be05f-ad20-4513-a142-38e9408f273a)
  )
  (fp_text value "IDC_P2.54_2x8" (at 0 0 90) (layer "F.Fab")
    (effects (font (size 1 1) (thickness 0.15)))
    (tstamp 89c42286-5be9-4cce-a7e9-dac0665b86c7)
  )
  (fp_text user "${REFERENCE}" (at 0 -0.254 90) (layer "F.Fab")
    (effects (font (size 1 1) (thickness 0.15)))
    (tstamp 0f3c24f4-254d-41cf-945b-801319a5d402)
  )
  (fp_line (start -3.302 2.032) (end -4.572 2.032) (layer "F.SilkS") (width 0.1778) (tstamp 7e59aa19-56ce-4f82-8cd1-2fb38875ffc6))
  (fp_line (start -3.302 12.7) (end -3.302 2.032) (layer "F.SilkS") (width 0.1778) (tstamp 8e346315-32f6-4593-9906-d2a9f14c9b9f))
  (fp_line (start -3.302 -12.7) (end 3.302 -12.7) (layer "F.SilkS") (width 0.1778) (tstamp 9c2842c1-4a90-47ef-8640-fb2c342b9b68))
  (fp_line (start 3.302 12.7) (end -3.302 12.7) (layer "F.SilkS") (width 0.1778) (tstamp 9da87c83-d865-47b2-950b-e7179cf8c155))
  (fp_line (start -3.302 -2.032) (end -3.302 -12.7) (layer "F.SilkS") (width 0.1778) (tstamp bf6037a6-bb7f-4f20-853d-9031f577e118))
  (fp_line (start -4.572 -2.032) (end -3.302 -2.032) (layer "F.SilkS") (width 0.1778) (tstamp c4d4c453-03b5-43d2-972e-807f8f09aa1b))
  (fp_line (start 3.302 -12.7) (end 3.302 12.7) (layer "F.SilkS") (width 0.1778) (tstamp d333d183-e9e9-425f-9387-8d0f96f1ceee))
  (fp_rect (start -4.572 -13.97) (end 4.572 13.97) (layer "F.SilkS") (width 0.1778) (fill none) (tstamp 98c34cfd-fbeb-4256-b4bf-6b184887cd77))
  (fp_poly (pts
      (xy -5.08 -8.89)
      (xy -5.842 -8.382)
      (xy -5.842 -9.398)
    ) (layer "F.SilkS") (width 0.1) (fill solid) (tstamp 302ae677-b83b-4a7d-8967-ac083e30aec4))
  (fp_rect (start -5.08 -14.478) (end 5.08 14.478) (layer "F.CrtYd") (width 0.0254) (fill none) (tstamp 21c966ea-56f0-4c40-a5fc-c2dfe5d4bd0b))
  (fp_line (start -4.572 -2.032) (end -3.302 -2.032) (layer "F.Fab") (width 0.1) (tstamp 1c3b8faa-0d27-4668-92b3-c39523d5ef49))
  (fp_line (start -4.572 -2.032) (end -4.572 -12.7) (layer "F.Fab") (width 0.1) (tstamp 3fade38b-5073-419e-8aba-30e572384f73))
  (fp_line (start 4.572 13.97) (end -4.572 13.97) (layer "F.Fab") (width 0.1) (tstamp 55deb8e7-894a-4e4e-89c2-1a7834a541d0))
  (fp_line (start -4.572 2.032) (end -4.572 13.97) (layer "F.Fab") (width 0.1) (tstamp 5dd028ce-8f32-4589-a2fd-b20349fb72c7))
  (fp_line (start 4.572 -13.97) (end 4.572 13.97) (layer "F.Fab") (width 0.1) (tstamp 5e345382-24ef-4c49-8b1c-cffafab2fa76))
  (fp_line (start -3.302 -13.97) (end 4.572 -13.97) (layer "F.Fab") (width 0.1) (tstamp 6eb416ef-8013-40b7-80b7-d15ef28d933a))
  (fp_line (start -3.302 12.7) (end 3.302 12.7) (layer "F.Fab") (width 0.1) (tstamp 6f88986f-f715-4535-a75f-8d68249f4b05))
  (fp_line (start 3.302 12.7) (end 3.302 -12.7) (layer "F.Fab") (width 0.1) (tstamp 894ccdb0-128b-4629-9ab3-ea45f8b8f432))
  (fp_line (start -3.302 -12.7) (end 3.302 -12.7) (layer "F.Fab") (width 0.1) (tstamp b2453206-eaa9-45a7-94ed-c6a8b048bdf5))
  (fp_line (start -3.302 -13.97) (end -4.572 -12.7) (layer "F.Fab") (width 0.1) (tstamp bd21f970-b076-486b-a0b3-45eb265a1f1e))
  (fp_line (start -4.572 2.032) (end -3.302 2.032) (layer "F.Fab") (width 0.1) (tstamp c303d9a2-c6c8-4285-b1cd-63db116c9824))
  (fp_line (start -3.302 -2.032) (end -3.302 -12.7) (layer "F.Fab") (width 0.1) (tstamp cd56b705-50ad-458f-a0fc-dff555e1abf3))
  (fp_line (start -3.302 12.7) (end -3.302 2.032) (layer "F.Fab") (width 0.1) (tstamp de5dda01-7af0-4e9b-8e65-4bb88c5ff400))
  (pad "1" thru_hole roundrect locked (at -1.27 -8.89) (size 1.778 1.778) (drill 1.016) (layers *.Cu *.Mask) (roundrect_rratio 0.15) (tstamp 33841fb2-7976-4422-9873-87b018585c9e))
  (pad "2" thru_hole circle locked (at 1.27 -8.89) (size 1.778 1.778) (drill 1.016) (layers *.Cu *.Mask) (tstamp 63c3dfb7-cd78-4783-a16e-7e8338726987))
  (pad "3" thru_hole circle locked (at -1.27 -6.35) (size 1.778 1.778) (drill 1.016) (layers *.Cu *.Mask) (tstamp 5c4a079c-3463-4d65-8f0b-05b18d6dd3cb))
  (pad "4" thru_hole circle (at 1.27 -6.35) (size 1.778 1.778) (drill 1.016) (layers *.Cu *.Mask) (tstamp 3a4d568f-f344-4c93-a5d6-71549bbb2f7c))
  (pad "5" thru_hole circle (at -1.27 -3.81) (size 1.778 1.778) (drill 1.016) (layers *.Cu *.Mask) (tstamp 0e174adb-e38e-41f7-8832-dcf0d8c4aca8))
  (pad "6" thru_hole circle (at 1.27 -3.81) (size 1.778 1.778) (drill 1.016) (layers *.Cu *.Mask) (tstamp 50a1a7ca-fed8-405e-a5a9-083da873b040))
  (pad "7" thru_hole circle (at -1.27 -1.27) (size 1.778 1.778) (drill 1.016) (layers *.Cu *.Mask) (tstamp 2d441a89-dc7e-492f-b577-e7b3529e7329))
  (pad "8" thru_hole circle (at 1.27 -1.27) (size 1.778 1.778) (drill 1.016) (layers *.Cu *.Mask) (tstamp 39093f53-5b44-4ba5-a981-cebfadab18de))
  (pad "9" thru_hole circle (at -1.27 1.27) (size 1.778 1.778) (drill 1.016) (layers *.Cu *.Mask) (tstamp e04683cd-09d5-4a93-9a12-6a1fe5444506))
  (pad "10" thru_hole circle (at 1.27 1.27) (size 1.778 1.778) (drill 1.016) (layers *.Cu *.Mask) (tstamp b4c77009-f343-40eb-957e-12b7a34b3e12))
  (pad "11" thru_hole circle (at -1.27 3.81) (size 1.778 1.778) (drill 1.016) (layers *.Cu *.Mask) (tstamp a01b2028-73f2-4b99-874e-d9b6165b9829))
  (pad "12" thru_hole circle (at 1.27 3.81) (size 1.778 1.778) (drill 1.016) (layers *.Cu *.Mask) (tstamp 0c673ee8-ac3d-4222-8978-3d59ffdee56a))
  (pad "13" thru_hole circle (at -1.27 6.35) (size 1.778 1.778) (drill 1.016) (layers *.Cu *.Mask) (tstamp 30b767ac-6198-4abb-97d4-536ac1986a6d))
  (pad "14" thru_hole circle (at 1.27 6.35) (size 1.778 1.778) (drill 1.016) (layers *.Cu *.Mask) (tstamp 9577d137-2ce6-4ac6-99ff-2822b9582fbb))
  (pad "15" thru_hole circle (at -1.27 8.89) (size 1.778 1.778) (drill 1.016) (layers *.Cu *.Mask) (tstamp ac0f6203-1937-441d-86f7-47a606aee3b7))
  (pad "16" thru_hole circle (at 1.27 8.89) (size 1.778 1.778) (drill 1.016) (layers *.Cu *.Mask) (tstamp 854282d9-3b36-4f00-a572-229d01dda4f5))
  (model "${KICAD6_3DMODEL_DIR}/Connector_IDC.3dshapes/IDC-Header_2x08_P2.54mm_Vertical.wrl"
    (offset (xyz -1.27 8.89 0))
    (scale (xyz 1 1 1))
    (rotate (xyz 0 0 0))
  )
)
