(footprint "Jack_3.5mm_PJ-342" (version 20210722) (generator pcbnew) (layer "F.Cu")
  (tedit 61755E9D)
  (fp_text reference "REF**" (at 0 5.842 unlocked) (layer "F.SilkS")
    (effects (font (size 1 1) (thickness 0.15)))
    (tstamp ab0ff9dd-569d-4c30-9b75-acaab9adc242)
  )
  (fp_text value "Jack_3.5mm_PJ-342" (at 0 13.97 unlocked) (layer "F.Fab")
    (effects (font (size 1 1) (thickness 0.15)))
    (tstamp a81aeaaf-4498-4176-bb55-9fb32c506ff8)
  )
  (fp_text user "${REFERENCE}" (at 0 4.318 unlocked) (layer "F.Fab")
    (effects (font (size 1 1) (thickness 0.15)))
    (tstamp dfe87f19-7983-4eaa-9915-b4b5c2cca2f3)
  )
  (fp_line (start -3.556 4.572) (end -3.556 3.048) (layer "F.SilkS") (width 0.1778) (tstamp 405b6f3d-012d-45c6-b6f5-647cd2471c16))
  (fp_line (start 2.032 -2.032) (end -2.032 -2.032) (layer "F.SilkS") (width 0.1778) (tstamp 59465ca6-34fa-4fa9-81e5-4e2a607ec5b7))
  (fp_line (start -3.556 12.7) (end 3.556 12.7) (layer "F.SilkS") (width 0.1778) (tstamp 5f99bcea-ead6-44c8-b7e6-a02300477813))
  (fp_line (start -3.556 0) (end 3.556 0) (layer "F.SilkS") (width 0.1778) (tstamp 8e48cbe0-f9d5-4970-a186-567f2005d644))
  (fp_line (start 3.556 0) (end 3.556 1.016) (layer "F.SilkS") (width 0.1778) (tstamp 9b070678-95d7-4651-bfd0-be7748fc77e1))
  (fp_line (start -3.556 9.906) (end -3.556 6.604) (layer "F.SilkS") (width 0.1778) (tstamp aa3877f7-878a-49c9-aa3e-5819cc5589c8))
  (fp_line (start -3.556 1.016) (end -3.556 0) (layer "F.SilkS") (width 0.1778) (tstamp b6cb7d37-d6cf-47db-aeb0-42353e2555d8))
  (fp_line (start -2.54 -1.524) (end -2.54 0) (layer "F.SilkS") (width 0.1778) (tstamp cccb6ad8-2fd5-4d8d-b31b-16d2dac3a588))
  (fp_line (start 3.556 3.302) (end 3.556 8.382) (layer "F.SilkS") (width 0.1778) (tstamp ea28059f-a38f-4953-ba89-f1798fc5b6bd))
  (fp_line (start 2.54 0) (end 2.54 -1.524) (layer "F.SilkS") (width 0.1778) (tstamp f4f549ea-bbfd-49ef-97b4-11c8c70e41a2))
  (fp_line (start -3.556 11.938) (end -3.556 12.7) (layer "F.SilkS") (width 0.1778) (tstamp fe3b6fec-5f66-427a-b076-b783c590cf65))
  (fp_arc (start 2.032 -1.524) (end 2.54 -1.524) (angle -90) (layer "F.SilkS") (width 0.1778) (tstamp 399d84f1-e985-40b8-b4c6-8db89cb702c3))
  (fp_arc (start -2.032 -1.524) (end -2.032 -2.032) (angle -90) (layer "F.SilkS") (width 0.1778) (tstamp 699c7354-4749-4c70-bd00-0029b5454ac6))
  (fp_rect (start -5.08 -2.286) (end 5.08 12.954) (layer "F.CrtYd") (width 0.0254) (fill none) (tstamp 0c72f42e-7b2d-41eb-a73e-27ea4a41758d))
  (fp_rect (start -3.556 -2.032) (end 3.556 12.7) (layer "F.Fab") (width 0.1) (fill none) (tstamp 0f0af475-bc1d-47f0-a2b9-e98267df867c))
  (pad "" np_thru_hole circle (at 0 2.5) (size 1.5 1.5) (drill 1.5) (layers F&B.Cu *.Mask) (tstamp 148207a2-d697-4420-be5a-fd9cb92053ab))
  (pad "" np_thru_hole circle (at 0 9.5) (size 1.5 1.5) (drill 1.5) (layers F&B.Cu *.Mask) (tstamp 7fde7d72-d225-4e1d-87ce-86394e2516de))
  (pad "R1" smd rect (at -3.5 5.5) (size 2.5 1.5) (layers "F.Cu" "F.Paste" "F.Mask")
    (solder_mask_margin 0.0762) (tstamp 7fbe0ad6-92cb-41c2-8671-742b8b884dbe))
  (pad "R1N" smd rect (at -3.5 11) (size 2.5 1.5) (layers "F.Cu" "F.Paste" "F.Mask")
    (solder_mask_margin 0.0762) (tstamp 1e13fcf4-01eb-4dd3-8ae6-2b500c64c150))
  (pad "R2" smd rect (at 3.5 2.1) (size 2.5 1.5) (layers "F.Cu" "F.Paste" "F.Mask")
    (solder_mask_margin 0.0762) (tstamp 36f08366-453f-4d34-b6af-a93f6c2ae7b6))
  (pad "S" smd rect (at -3.5 2.1) (size 2.5 1.5) (layers "F.Cu" "F.Paste" "F.Mask")
    (solder_mask_margin 0.0762) (tstamp 045f041b-55fe-49d2-9128-d3fb7c9b56f9))
  (pad "T" smd rect (at 3.5 9.3) (size 2.5 1.5) (layers "F.Cu" "F.Paste" "F.Mask")
    (solder_mask_margin 0.0762) (tstamp 0db8d3bd-740d-4ab9-bece-3e068a59fc18))
  (pad "TN" smd rect (at 3.5 11.5) (size 2.5 1.5) (layers "F.Cu" "F.Paste" "F.Mask")
    (solder_mask_margin 0.0762) (tstamp b5c3d8df-fbe2-4af2-b597-e68ef4924c51))
)
