(footprint "Diode_Bridge_MSB" (version 20210722) (generator pcbnew) (layer "F.Cu")
  (tedit 61755861)
  (descr "SMD diode bridge ABS (Diotec), see https://diotec.com/tl_files/diotec/files/pdf/datasheets/abs2.pdf")
  (tags "ABS MBLS")
  (attr smd)
  (fp_text reference "REF**" (at 0 0) (layer "F.SilkS")
    (effects (font (size 1.016 1.016) (thickness 0.1778)))
    (tstamp fd0b468d-3f5a-4909-a874-ca66ae294818)
  )
  (fp_text value "Diode_Bridge_MSB" (at 0 3.7) (layer "F.Fab")
    (effects (font (size 1 1) (thickness 0.15)))
    (tstamp 4a74f154-07e5-4aa5-ae51-4b0b8a021e42)
  )
  (fp_text user "${REFERENCE}" (at 0 -0.065) (layer "F.Fab")
    (effects (font (size 1 1) (thickness 0.15)))
    (tstamp f5bad6da-967b-4b7b-9ec6-5c65a4ee0730)
  )
  (fp_line (start -1.651 -3.048) (end -1.651 -2.032) (layer "F.SilkS") (width 0.1778) (tstamp 4f07c107-3b05-4cb2-88ad-8de524680ea2))
  (fp_line (start -2.159 2.54) (end -1.143 2.54) (layer "F.SilkS") (width 0.1778) (tstamp acb12e80-c3fb-44de-b4e8-fa7da481f880))
  (fp_line (start -2.159 -2.54) (end -1.143 -2.54) (layer "F.SilkS") (width 0.1778) (tstamp f50911bf-2e7d-45b9-92ce-977f7af5489b))
  (fp_rect (start -2.54 -3.302) (end 2.54 3.302) (layer "F.SilkS") (width 0.1778) (fill none) (tstamp b735e5a3-5016-438e-8da7-c795756b952e))
  (fp_arc (start 1.778 2.54) (end 2.032 2.54) (angle -180) (layer "F.SilkS") (width 0.1778) (tstamp 02f0a244-d1af-4fef-b3d0-dbe89d50071d))
  (fp_arc (start 1.397 -2.413) (end 1.143 -2.413) (angle -180) (layer "F.SilkS") (width 0.1778) (tstamp 2e71abd3-457e-4398-98ce-5204a3a135ef))
  (fp_arc (start 1.905 -2.413) (end 2.159 -2.413) (angle -180) (layer "F.SilkS") (width 0.1778) (tstamp ac4e8b76-5ef2-4da8-890a-f92894d91d10))
  (fp_arc (start 1.27 2.54) (end 1.016 2.54) (angle -180) (layer "F.SilkS") (width 0.1778) (tstamp d3f622dc-4e9f-4c1c-a928-e4d4495eb446))
  (fp_poly (pts
      (xy -4.826 -2.54)
      (xy -5.334 -2.032)
      (xy -5.334 -3.048)
    ) (layer "F.SilkS") (width 0.1) (fill solid) (tstamp 90a0369a-095a-4e20-bcfe-4a4a906959df))
  (fp_rect (start -4.826 -3.429) (end 4.826 3.429) (layer "F.CrtYd") (width 0.0254) (fill none) (tstamp 9b4bea19-cf08-421a-969a-6fe8f9ec419f))
  (fp_line (start -1.8 -2.5) (end -2.2 -2) (layer "F.Fab") (width 0.12) (tstamp 0e211c08-cc8f-4931-a36b-ae51be46e98d))
  (fp_line (start -2.2 2.5) (end 2.2 2.5) (layer "F.Fab") (width 0.12) (tstamp 5a41b12a-81c5-4496-b1ae-709f2d4a9e4c))
  (fp_line (start 2.2 2.5) (end 2.2 -2.5) (layer "F.Fab") (width 0.12) (tstamp a3615b86-94e2-4f54-8721-a67955e139be))
  (fp_line (start -2.2 -2) (end -2.2 2.5) (layer "F.Fab") (width 0.12) (tstamp a368544a-864b-42d9-9003-373d940954c8))
  (fp_line (start 2.2 -2.5) (end -1.8 -2.5) (layer "F.Fab") (width 0.12) (tstamp c64bc5a6-8936-4241-8097-51873101fe4d))
  (pad "1" smd rect locked (at -3.683 -2.54) (size 1.778 1.27) (layers "F.Cu" "F.Paste" "F.Mask")
    (solder_mask_margin 0.0762) (tstamp 780cc30d-06b1-4e69-8a74-faa2ffa7e5c0))
  (pad "2" smd rect locked (at -3.683 2.54) (size 1.778 1.27) (layers "F.Cu" "F.Paste" "F.Mask")
    (solder_mask_margin 0.0762) (tstamp 4a6c60df-33df-47b8-8646-414f5f05a851))
  (pad "3" smd rect locked (at 3.683 2.54) (size 1.778 1.27) (layers "F.Cu" "F.Paste" "F.Mask")
    (solder_mask_margin 0.0762) (tstamp d5cf98a2-46bb-49ba-8cb9-d044f2e9c2e1))
  (pad "4" smd rect locked (at 3.683 -2.54) (size 1.778 1.27) (layers "F.Cu" "F.Paste" "F.Mask")
    (solder_mask_margin 0.0762) (tstamp f3ae9617-5e1a-480e-93ed-0e3fb874c313))
  (model "${KICAD6_3DMODEL_DIR}/Diode_SMD.3dshapes/Diode_Bridge_Diotec_ABS.wrl"
    (offset (xyz 0 0 0))
    (scale (xyz 1 1 1))
    (rotate (xyz 0 0 0))
  )
)
