(footprint "B0603S" (version 20211014) (generator pcbnew)
  (layer "F.Cu")
  (tedit 61755050)
  (descr "Capacitor SMD 0603 (1608 Metric), square (rectangular) end terminal, IPC_7351 nominal, (Body size source: IPC-SM-782 page 76, https://www.pcb-3d.com/wordpress/wp-content/uploads/ipc-sm-782a_amendment_1_and_2.pdf), generated with kicad-footprint-generator")
  (tags "capacitor")
  (attr smd)
  (fp_text reference "REF**" (at 0 0) (layer "F.SilkS")
    (effects (font (size 1.016 1.016) (thickness 0.1778)))
    (tstamp c01ad790-f59c-430d-bb89-f5b67adf107b)
  )
  (fp_text value "B0603S" (at 0 0) (layer "F.Fab")
    (effects (font (size 0.508 0.508) (thickness 0.127)))
    (tstamp dd7cccec-af4c-438f-8b87-ee399b0a954b)
  )
  (fp_text user "${REFERENCE}" (at 0 0) (layer "F.Fab")
    (effects (font (size 0.508 0.508) (thickness 0.127)))
    (tstamp 67854c02-116d-44ba-a488-1a89f9571c5b)
  )
  (fp_line (start 1.2065 0.5715) (end 1.2065 -0.5715) (layer "F.SilkS") (width 0.1778) (tstamp 1d5c0e94-5cd2-4bba-b108-33ae9b7d6169))
  (fp_line (start 1.2065 -0.4445) (end 1.0795 -0.5715) (layer "F.SilkS") (width 0.1778) (tstamp 468ec35f-e1e8-491b-887b-c2c2d61a6f43))
  (fp_line (start -1.2065 -0.4445) (end -1.0795 -0.5715) (layer "F.SilkS") (width 0.1778) (tstamp 510baaa8-7c50-4546-b643-b4673bbde9c4))
  (fp_line (start 0.381 0.5715) (end 1.2065 0.5715) (layer "F.SilkS") (width 0.1778) (tstamp 59f93f78-1040-4dea-ad1a-053966d9af99))
  (fp_line (start 1.2065 -0.5715) (end 0.381 -0.5715) (layer "F.SilkS") (width 0.1778) (tstamp 961aba22-20db-4110-a91a-7c6f0e546225))
  (fp_line (start 1.0795 0.5715) (end 1.2065 0.4445) (layer "F.SilkS") (width 0.1778) (tstamp a00d1b26-9831-4f99-bcdd-be13eef04076))
  (fp_line (start -0.3175 -0.5715) (end -1.2065 -0.5715) (layer "F.SilkS") (width 0.1778) (tstamp b2747f40-4e05-48a6-8c11-366de674c029))
  (fp_line (start -1.2065 -0.5715) (end -1.2065 0.5715) (layer "F.SilkS") (width 0.1778) (tstamp e6eabf62-d2f0-4e2f-afe4-008fe163dfc7))
  (fp_line (start -1.2065 0.4445) (end -1.0795 0.5715) (layer "F.SilkS") (width 0.1778) (tstamp f43a50bc-fd4d-4a13-9b4f-f9696f1b1e51))
  (fp_line (start -1.2065 0.5715) (end -0.3175 0.5715) (layer "F.SilkS") (width 0.1778) (tstamp f9fb619e-3da2-4d37-a199-eba28cb3531a))
  (fp_rect (start -1.3335 -0.635) (end 1.3335 0.635) (layer "F.CrtYd") (width 0.0254) (fill none) (tstamp dccf462f-af5d-4e59-ae95-a4f7d502ff3a))
  (fp_line (start 1.143 0.508) (end 1.143 -0.508) (layer "F.Fab") (width 0.1016) (tstamp 683b94e5-03f6-4149-8d5c-2c5a5c8d9ea3))
  (fp_line (start 1.143 0.508) (end -1.143 0.508) (layer "F.Fab") (width 0.1016) (tstamp 876aaa5b-5d49-4b35-91fc-92b1ea5774b3))
  (fp_line (start -1.143 0.508) (end -1.143 -0.508) (layer "F.Fab") (width 0.1016) (tstamp 90ae8385-25e3-4b5c-9b23-f13437897962))
  (fp_line (start -1.143 -0.508) (end 1.143 -0.508) (layer "F.Fab") (width 0.1016) (tstamp b2ae2b57-5a06-4085-904c-3b210d885134))
  (pad "1" smd rect (at -0.7112 0) (size 0.635 0.889) (layers "F.Cu" "F.Paste" "F.Mask")
    (solder_mask_margin 0.0762) (tstamp 7a463dda-dc5f-40c6-a6d1-3d0473aef109))
  (pad "2" smd rect (at 0.7112 0) (size 0.635 0.889) (layers "F.Cu" "F.Paste" "F.Mask")
    (solder_mask_margin 0.0762) (tstamp 8c62935b-bbfa-4adc-89fc-af925cdffa00))
  (model "${KICAD6_3DMODEL_DIR}/Inductor_SMD.3dshapes/L_0603_1608Metric.step"
    (offset (xyz 0 0 0))
    (scale (xyz 1 1 1))
    (rotate (xyz 0 0 0))
  )
)
