(footprint "MountingHole_3.3_M3" (version 20210228) (generator pcbnew) (layer "F.Cu")
  (tedit 6068292C)
  (descr "Mounting Hole 3.2mm, M3")
  (tags "mounting hole 3.2mm m3")
  (attr exclude_from_pos_files exclude_from_bom)
  (fp_text reference "REF**" (at 0 -4.2) (layer "F.SilkS")
    (effects (font (size 1 1) (thickness 0.15)))
    (tstamp c75fd4ca-67d9-492b-b3fc-c92f4f0d7dc0)
  )
  (fp_text value "MountingHole_3.3_M3" (at 0 4.2) (layer "F.Fab")
    (effects (font (size 1 1) (thickness 0.15)))
    (tstamp a895e2ac-cf27-45dd-b18e-444e7e1a433b)
  )
  (fp_text user "${REFERENCE}" (at 0.3 0) (layer "F.Fab")
    (effects (font (size 1 1) (thickness 0.15)))
    (tstamp 44048898-43d1-4a43-bb49-db8577c778ba)
  )
  (fp_circle (center 0 0) (end 3.2 0) (layer "Cmts.User") (width 0.15) (fill none) (tstamp 23e03d38-44d5-4878-b849-fb23ffffb402))
  (fp_circle (center 0 0) (end 3.45 0) (layer "F.CrtYd") (width 0.05) (fill none) (tstamp 977474a5-3beb-4d08-baf9-c866c6c6a068))
  (pad "1" thru_hole circle (at 1.697056 -1.697056) (locked) (size 0.8 0.8) (drill 0.508) (layers *.Cu *.Mask) (tstamp 078eb360-fba4-44bd-8287-8e2a0708ba7b))
  (pad "1" thru_hole circle (at 0 0) (locked) (size 6.35 6.35) (drill 3.302) (layers *.Cu *.Mask) (tstamp 328b9c29-c788-4649-868b-b25cfc4f8495))
  (pad "1" thru_hole circle (at -1.697056 -1.697056) (locked) (size 0.8 0.8) (drill 0.508) (layers *.Cu *.Mask) (tstamp 4ce0b0d5-d283-4cf5-9727-a3760d3c7ea6))
  (pad "1" thru_hole circle (at -2.4 0) (locked) (size 0.8 0.8) (drill 0.508) (layers *.Cu *.Mask) (tstamp 7c6b4bc6-ae8d-4f71-b631-bdbf2e588af9))
  (pad "1" thru_hole circle (at -1.697056 1.697056) (locked) (size 0.8 0.8) (drill 0.508) (layers *.Cu *.Mask) (tstamp 82f35b73-6c84-4faa-b001-72a27cf58c68))
  (pad "1" thru_hole circle (at 0 -2.4) (locked) (size 0.8 0.8) (drill 0.508) (layers *.Cu *.Mask) (tstamp a5f1e002-3d3c-4639-8d68-7f28f3924d25))
  (pad "1" thru_hole circle (at 2.4 0) (locked) (size 0.8 0.8) (drill 0.508) (layers *.Cu *.Mask) (tstamp b4dc4fb1-64d6-4ee9-8508-8ff785d7420c))
  (pad "1" thru_hole circle (at 1.697056 1.697056) (locked) (size 0.8 0.8) (drill 0.508) (layers *.Cu *.Mask) (tstamp b9d02c52-c511-4df8-892e-a146b07932a6))
  (pad "1" thru_hole circle (at 0 2.4) (locked) (size 0.8 0.8) (drill 0.508) (layers *.Cu *.Mask) (tstamp c17c2ad0-a477-478f-a782-1ee1de5d33ac))
)
