(footprint "FFC15_P1.0_686115183422" (version 20210722) (generator pcbnew) (layer "F.Cu")
  (tedit 61755A20)
  (fp_text reference "REF**" (at 0 -2.54 unlocked) (layer "F.SilkS")
    (effects (font (size 1 1) (thickness 0.15)))
    (tstamp 350af4db-eee2-4143-85d2-10ae4f4bda63)
  )
  (fp_text value "FFC15_P1.0_686115183422" (at 0 1.524 unlocked) (layer "F.Fab")
    (effects (font (size 1 1) (thickness 0.15)))
    (tstamp a0a6cf97-2e93-4467-9dfe-b940ccc016d9)
  )
  (fp_text user "${REFERENCE}" (at 0 -2.54 unlocked) (layer "F.Fab")
    (effects (font (size 1 1) (thickness 0.15)))
    (tstamp 52e6beec-4d50-446d-8eff-dbf22eac58e9)
  )
  (fp_line (start -9.906 -3.302) (end -10.16 -3.302) (layer "F.SilkS") (width 0.1778) (tstamp 58595299-a506-4351-b853-9e50b0a248e1))
  (fp_line (start 9.652 -2.794) (end 9.652 -3.048) (layer "F.SilkS") (width 0.1778) (tstamp 5c2f682e-e0fd-46ea-a8dc-0d31c32ea7bb))
  (fp_line (start -10.16 -3.302) (end -10.16 -3.81) (layer "F.SilkS") (width 0.1778) (tstamp 65f57b54-7b50-4b27-9814-af840d1e3678))
  (fp_line (start -9.398 -0.762) (end 9.398 -0.762) (layer "F.SilkS") (width 0.1778) (tstamp 750cb082-c834-4ea7-a986-a6231a247fc0))
  (fp_line (start -9.652 -2.794) (end -9.652 -3.048) (layer "F.SilkS") (width 0.1778) (tstamp 7de46c87-23dd-45da-b0fb-0290eb7ffe00))
  (fp_line (start 10.16 -3.302) (end 10.16 -3.81) (layer "F.SilkS") (width 0.1778) (tstamp 8bb8ed3e-e221-48f8-a1f0-5895a27f073f))
  (fp_line (start 10.16 -3.81) (end -10.16 -3.81) (layer "F.SilkS") (width 0.1778) (tstamp be30915e-8efe-4145-930d-d70c6d8d16dc))
  (fp_line (start 9.906 -3.302) (end 10.16 -3.302) (layer "F.SilkS") (width 0.1778) (tstamp cedfe778-34aa-40ec-923d-18cf4e81cd5c))
  (fp_arc (start -9.398 -1.015998) (end -9.398 -0.762) (angle 90) (layer "F.SilkS") (width 0.1778) (tstamp 42748548-3a82-425e-b301-dd2e4c8f2426))
  (fp_arc (start 9.905998 -3.048) (end 9.652 -3.048) (angle 90) (layer "F.SilkS") (width 0.1778) (tstamp 61b732a6-ce3e-4c09-830c-9ee683ef1f36))
  (fp_arc (start -9.906 -3.048002) (end -9.652 -3.048) (angle -90) (layer "F.SilkS") (width 0.1778) (tstamp d0195953-141c-4186-bcc4-1fd61b21c5e7))
  (fp_arc (start 9.398002 -1.016) (end 9.652 -1.016) (angle 90) (layer "F.SilkS") (width 0.1778) (tstamp d8922a58-4155-43c1-aca9-ba21c2fb6625))
  (fp_rect (start -10.922 -4.064) (end 10.922 0.762) (layer "F.CrtYd") (width 0.0254) (fill none) (tstamp 49fa3ecd-1f39-4d7b-b4a2-a5e024fcdc3a))
  (fp_rect (start -10.16 -3.81) (end 10.16 -0.762) (layer "F.Fab") (width 0.1) (fill none) (tstamp b31a0687-8118-45e5-b9ec-ca110df9efa1))
  (pad "1" smd rect (at -7 0) (size 0.3 1.2) (layers "F.Cu" "F.Paste" "F.Mask")
    (solder_mask_margin 0.0762) (tstamp f2869dc9-4333-4cfa-a818-9b243534cdad))
  (pad "2" smd rect (at -6 0) (size 0.3 1.2) (layers "F.Cu" "F.Paste" "F.Mask")
    (solder_mask_margin 0.0762) (tstamp 33289324-559b-463f-8447-cb53011b0c12))
  (pad "3" smd rect (at -5 0) (size 0.3 1.2) (layers "F.Cu" "F.Paste" "F.Mask")
    (solder_mask_margin 0.0762) (tstamp 35fdb183-8389-4558-8636-505879f73943))
  (pad "4" smd rect (at -4 0) (size 0.3 1.2) (layers "F.Cu" "F.Paste" "F.Mask")
    (solder_mask_margin 0.0762) (tstamp 4d50ca84-0372-406c-95fa-5abd4956fd46))
  (pad "5" smd rect (at -3 0) (size 0.3 1.2) (layers "F.Cu" "F.Paste" "F.Mask")
    (solder_mask_margin 0.0762) (tstamp da8bbf42-fdb1-42d4-9f9f-2356cbab22ec))
  (pad "6" smd rect (at -2 0) (size 0.3 1.2) (layers "F.Cu" "F.Paste" "F.Mask")
    (solder_mask_margin 0.0762) (tstamp ad4b54fa-3ea4-4a7f-a37e-216d9316897d))
  (pad "7" smd rect (at -1 0) (size 0.3 1.2) (layers "F.Cu" "F.Paste" "F.Mask")
    (solder_mask_margin 0.0762) (tstamp 1d7a6636-7384-4f14-b6ca-9255ca5107be))
  (pad "8" smd rect (at 0 0) (size 0.3 1.2) (layers "F.Cu" "F.Paste" "F.Mask")
    (solder_mask_margin 0.0762) (tstamp 6112d63c-0179-4c0d-833f-e0a2c4fd3cbb))
  (pad "9" smd rect (at 1 0) (size 0.3 1.2) (layers "F.Cu" "F.Paste" "F.Mask")
    (solder_mask_margin 0.0762) (tstamp 7393f232-e058-4cb2-be44-5d930209fe74))
  (pad "10" smd rect (at 2 0) (size 0.3 1.2) (layers "F.Cu" "F.Paste" "F.Mask")
    (solder_mask_margin 0.0762) (tstamp 84b8a166-9327-4358-abbd-9377c1835d47))
  (pad "11" smd rect (at 3 0) (size 0.3 1.2) (layers "F.Cu" "F.Paste" "F.Mask")
    (solder_mask_margin 0.0762) (tstamp 967c89cb-487f-4320-b190-b10e14bbbb5d))
  (pad "12" smd rect (at 4 0) (size 0.3 1.2) (layers "F.Cu" "F.Paste" "F.Mask")
    (solder_mask_margin 0.0762) (tstamp 9c37beef-766d-465e-baae-e27bbbf6fd60))
  (pad "13" smd rect (at 5 0) (size 0.3 1.2) (layers "F.Cu" "F.Paste" "F.Mask")
    (solder_mask_margin 0.0762) (tstamp 34c01566-0a13-4088-a81f-6262116f0821))
  (pad "14" smd rect (at 6 0) (size 0.3 1.2) (layers "F.Cu" "F.Paste" "F.Mask")
    (solder_mask_margin 0.0762) (tstamp b0d8ad6f-d27c-450d-b976-6718ac7c0c3c))
  (pad "15" smd rect (at 7 0) (size 0.3 1.2) (layers "F.Cu" "F.Paste" "F.Mask")
    (solder_mask_margin 0.0762) (tstamp b7fa1b42-7888-49f5-aee6-0c4a40ad1235))
  (pad "SH" smd rect (at -9.775 -1.9) (size 1.65 1.3) (layers "F.Cu" "F.Paste" "F.Mask")
    (solder_mask_margin 0.0762) (tstamp 304a12df-fe60-4b29-a6c0-1ff6f7739159))
  (pad "SH" smd rect (at 9.775 -1.9) (size 1.65 1.3) (layers "F.Cu" "F.Paste" "F.Mask")
    (solder_mask_margin 0.0762) (tstamp b5527fb6-f642-400d-8a79-f59d928ad5d0))
)
