(footprint "KeyChain" (version 20211014) (generator pcbnew) (layer "F.Cu")
  (tedit 6179FFDE)
  (descr "Circular Fiducial, 1mm bare copper, 2mm soldermask opening (Level A)")
  (tags "fiducial")
  (attr smd)
  (fp_text reference "REF**" (at 0 -2) (layer "F.SilkS")
    (effects (font (size 1 1) (thickness 0.15)))
    (tstamp 58dbc125-7ce1-47bf-acfc-a66b02358362)
  )
  (fp_text value "KeyChain" (at 0 2) (layer "F.Fab")
    (effects (font (size 1 1) (thickness 0.15)))
    (tstamp eddc2dd6-70ba-4c3c-bcd8-9c6d9f80e52f)
  )
  (fp_text user "${REFERENCE}" (at 0 0) (layer "F.Fab")
    (effects (font (size 0.4 0.4) (thickness 0.06)))
    (tstamp 26c2c872-3a96-4915-a425-2496c3a58a0c)
  )
  (fp_circle (center 0 0) (end 1.27 0) (layer "F.CrtYd") (width 0.0254) (fill none) (tstamp 326ff4c3-768b-423e-acde-1a0cbbbbfde3))
  (pad "" thru_hole circle locked (at 0 0) (size 4 4) (drill 3) (layers *.Cu *.Mask) (tstamp 90c874ae-6cc7-47b7-b6b2-51c0a886c2de))
)
