(footprint "nanoSIM_GCT_SIM8065-6-1-14-01-A" (version 20211014) (generator pcbnew)
  (layer "F.Cu")
  (tedit 61756163)
  (fp_text reference "REF**" (at 3.048 1.016 unlocked) (layer "F.SilkS")
    (effects (font (size 1 1) (thickness 0.15)))
    (tstamp 3ecac90f-9a37-4806-bee4-f5e022b0081d)
  )
  (fp_text value "nanoSIM_GCT_SIM8065-6-1-14-01-A" (at 5.588 14.478 unlocked) (layer "F.Fab")
    (effects (font (size 1 1) (thickness 0.15)))
    (tstamp 021ee5a5-f41e-4db5-bd20-07b624ac8e0e)
  )
  (fp_text user "${REFERENCE}" (at 6.35 6.096 unlocked) (layer "F.Fab")
    (effects (font (size 1 1) (thickness 0.15)))
    (tstamp ff1edc9d-3bf6-45b4-81be-69f63aabef98)
  )
  (fp_line (start 0 10.668) (end 0 1.27) (layer "F.SilkS") (width 0.1778) (tstamp 0c989c44-cda3-47c3-b461-600eee521659))
  (fp_line (start 10.414 11.43) (end 11.43 12.446) (layer "F.SilkS") (width 0.1778) (tstamp 2920745e-bbda-4d9f-8686-1f1548ee317b))
  (fp_line (start 7.366 4.318) (end 8.128 3.556) (layer "F.SilkS") (width 0.1778) (tstamp 4af0e854-d69d-4cd7-bc42-03d116b3e980))
  (fp_line (start 1.778 12.446) (end 2.794 11.43) (layer "F.SilkS") (width 0.1778) (tstamp 7f36f1a9-e81e-45ff-bd34-86f8b2b52e97))
  (fp_line (start 8.128 3.556) (end 10.16 3.556) (layer "F.SilkS") (width 0.1778) (tstamp a2993299-691e-4d0b-883e-890a7a793dca))
  (fp_line (start 10.16 7.62) (end 7.366 7.62) (layer "F.SilkS") (width 0.1778) (tstamp aae0a91a-f345-458f-8439-1c8716f73785))
  (fp_line (start 10.16 3.556) (end 10.16 7.62) (layer "F.SilkS") (width 0.1778) (tstamp bb81e0f4-8c9b-4e9f-bde8-1ec1dec4d32c))
  (fp_line (start 0.762 -0.508) (end 12.192 -0.508) (layer "F.SilkS") (width 0.1778) (tstamp d0e60ae2-9ddc-4c9a-9c6a-82137cc1be27))
  (fp_line (start 0.762 12.7) (end 12.192 12.7) (layer "F.SilkS") (width 0.1778) (tstamp dc3a8ac4-f039-4846-bd07-8515b47e4bcb))
  (fp_line (start 12.954 1.27) (end 12.954 10.668) (layer "F.SilkS") (width 0.1778) (tstamp e96a76f0-d69d-4ba6-936d-bb9188920eea))
  (fp_line (start 7.366 7.62) (end 7.366 4.318) (layer "F.SilkS") (width 0.1778) (tstamp ef2f1a07-cd16-4279-9cc9-1136d4c8f164))
  (fp_line (start 2.794 11.43) (end 10.414 11.43) (layer "F.SilkS") (width 0.1778) (tstamp fa3eb607-132a-458a-b921-59ac9e92b9b7))
  (fp_rect (start -0.762 13.462) (end 13.716 -2.54) (layer "F.CrtYd") (width 0.0254) (fill none) (tstamp 0993f2f8-44cf-474e-85a7-67d93ba4080d))
  (fp_rect (start 0 12.7) (end 12.954 -0.508) (layer "F.Fab") (width 0.1) (fill none) (tstamp c0fabd4a-6750-4ab8-8b10-0050f256fc52))
  (pad "" np_thru_hole circle (at 1.5 10.75) (size 0.75 0.75) (drill 0.75) (layers F&B.Cu *.Mask) (tstamp cc91beca-667e-4ecc-bfa3-5f4eb6bb6a76))
  (pad "" np_thru_hole circle (at 10 10.75) (size 0.75 0.75) (drill 0.75) (layers F&B.Cu *.Mask) (tstamp e5276a7e-74cc-41e5-a8ce-3034281070d6))
  (pad "C1" smd rect (at 6.75 -1.6) (size 0.8 1.4) (layers "F.Cu" "F.Paste" "F.Mask")
    (solder_mask_margin 0.0762) (tstamp 86de7e10-7034-44cd-9f99-28308572dbe0))
  (pad "C2" smd rect (at 4.21 -1.6) (size 0.8 1.4) (layers "F.Cu" "F.Paste" "F.Mask")
    (solder_mask_margin 0.0762) (tstamp 2c299291-43f6-4443-9ac3-33c257df2e7c))
  (pad "C3" smd rect (at 1.67 -1.6) (size 0.8 1.4) (layers "F.Cu" "F.Paste" "F.Mask")
    (solder_mask_margin 0.0762) (tstamp 4f6ece85-162c-4172-8a5f-15774b4da2a3))
  (pad "C5" smd rect (at 8.02 -1.6) (size 0.8 1.4) (layers "F.Cu" "F.Paste" "F.Mask")
    (solder_mask_margin 0.0762) (tstamp 1fa736cb-cb7c-46bc-a80a-1cec8f77634e))
  (pad "C6" smd rect (at 5.48 -1.6) (size 0.8 1.4) (layers "F.Cu" "F.Paste" "F.Mask")
    (solder_mask_margin 0.0762) (tstamp fb63f2ae-e2f6-43b9-a10b-35b14bfd4b3a))
  (pad "C7" smd rect (at 2.94 -1.6) (size 0.8 1.4) (layers "F.Cu" "F.Paste" "F.Mask")
    (solder_mask_margin 0.0762) (tstamp 15bdac85-a20b-4185-99c0-a0c288c65843))
  (pad "CD" smd rect (at 9.12 -1.6) (size 0.8 1.4) (layers "F.Cu" "F.Paste" "F.Mask")
    (solder_mask_margin 0.0762) (tstamp f00fb67f-793a-4707-ae61-adc8cdce4cbc))
  (pad "SH" smd rect (at 13 0) (size 0.8 2.1) (layers "F.Cu" "F.Paste" "F.Mask")
    (solder_mask_margin 0.0762) (tstamp 939beb4f-3a57-4ce1-9081-123ba062a35a))
  (pad "SH" smd rect (at 0 12) (size 0.8 2.1) (layers "F.Cu" "F.Paste" "F.Mask")
    (solder_mask_margin 0.0762) (tstamp df7466f2-ca2d-4bbf-a727-b5fc66a7a473))
  (pad "SH" smd rect (at 0 0) (size 0.8 2.1) (layers "F.Cu" "F.Paste" "F.Mask")
    (solder_mask_margin 0.0762) (tstamp e8ebab81-9ed0-4e7a-804b-0250939ed61d))
  (pad "SH" smd rect (at 13 12) (size 0.8 2.1) (layers "F.Cu" "F.Paste" "F.Mask")
    (solder_mask_margin 0.0762) (tstamp ed872be4-7b67-41f1-984a-6d6c73316993))
)
