(footprint "PH_P2.0_11" (version 20210722) (generator pcbnew) (layer "F.Cu")
  (tedit 6176BFD9)
  (descr "JST PH series connector, B16B-PH-K (http://www.jst-mfg.com/product/pdf/eng/ePH.pdf), generated with kicad-footprint-generator")
  (tags "connector JST PH side entry")
  (fp_text reference "REF**" (at 0 0) (layer "F.SilkS")
    (effects (font (size 1 1) (thickness 0.15)))
    (tstamp 6c4c6315-b5d8-443f-8e9c-cba8d4bd2cdf)
  )
  (fp_text value "PH_P2.0_11" (at 0 0) (layer "F.Fab")
    (effects (font (size 1 1) (thickness 0.15)))
    (tstamp 290ccb9c-dab6-416d-a1e0-fc6dfa820371)
  )
  (fp_text user "${REFERENCE}" (at 0 0) (layer "F.Fab")
    (effects (font (size 1 1) (thickness 0.15)))
    (tstamp 542b099e-2923-490a-8ba6-b3154d7650f9)
  )
  (fp_line (start 11.684 0.762) (end 11.684 2.54) (layer "F.SilkS") (width 0.1778) (tstamp 097b92f6-6091-4ff8-ab5a-dc1c44ad01aa))
  (fp_line (start 11.684 2.54) (end -11.684 2.54) (layer "F.SilkS") (width 0.1778) (tstamp 2a2661fe-585a-42c3-a0a2-06b8ded0ce96))
  (fp_line (start -11.684 0.762) (end -11.684 2.54) (layer "F.SilkS") (width 0.1778) (tstamp 4d06abf2-189a-4e23-8a58-68f0f1cefba4))
  (fp_line (start 9.652 -1.778) (end 9.652 -1.27) (layer "F.SilkS") (width 0.1778) (tstamp 98c92ad9-6994-4f79-9c33-173fca79d7ed))
  (fp_line (start -11.684 -1.27) (end -11.684 -0.508) (layer "F.SilkS") (width 0.1778) (tstamp a34efd6c-5127-4c42-a028-2d4ce93fc96e))
  (fp_line (start 9.652 -1.27) (end 11.684 -1.27) (layer "F.SilkS") (width 0.1778) (tstamp a61045cd-b8ed-4de5-871f-631ed0dc894b))
  (fp_line (start 11.684 -1.27) (end 11.684 -0.508) (layer "F.SilkS") (width 0.1778) (tstamp aa0b1254-9855-4bad-a9bd-4a6c88dd6ce7))
  (fp_line (start -12.446 -2.032) (end -11.176 -2.032) (layer "F.SilkS") (width 0.1778) (tstamp ab12618e-0c57-4937-a7da-fe9e13169b44))
  (fp_line (start -12.446 -2.032) (end -12.446 -0.762) (layer "F.SilkS") (width 0.1778) (tstamp be0a3817-9130-4a91-a4b4-e5c002ad17b8))
  (fp_line (start -9.652 -1.778) (end -9.652 -1.27) (layer "F.SilkS") (width 0.1778) (tstamp e8f10ac8-a005-4627-9d61-31a9510a3c48))
  (fp_line (start -9.652 -1.27) (end -11.684 -1.27) (layer "F.SilkS") (width 0.1778) (tstamp f1bef95d-eaa5-4c96-b04d-55df2e5b296d))
  (fp_rect (start -5.05 2.246) (end -4.95 2.5) (layer "F.SilkS") (width 0.1778) (fill none) (tstamp 143e461d-7ce2-4bab-a97e-86a3fd745cc9))
  (fp_rect (start -12.192 -0.508) (end -11.684 0.762) (layer "F.SilkS") (width 0.1778) (fill none) (tstamp 313df68d-71e9-4f4f-93ea-fe777c8f2656))
  (fp_rect (start -12.192 -1.778) (end 12.192 3.048) (layer "F.SilkS") (width 0.1778) (fill none) (tstamp 497c6e3f-5eb5-44d0-a5a1-e9c967d739ed))
  (fp_rect (start -7.05 2.246) (end -6.95 2.5) (layer "F.SilkS") (width 0.1778) (fill none) (tstamp 58a5bcd1-d162-4c6d-a3ed-363eafa0f794))
  (fp_rect (start 0.95 2.242) (end 1.05 2.496) (layer "F.SilkS") (width 0.1778) (fill none) (tstamp 96034ec9-49fb-4060-90f9-7ffc4f8a001d))
  (fp_rect (start 6.95 2.246) (end 7.05 2.5) (layer "F.SilkS") (width 0.1778) (fill none) (tstamp 9d0dd5cb-7ffa-4b50-80fe-c4d2ecfa57f3))
  (fp_rect (start -1.05 2.246) (end -0.95 2.5) (layer "F.SilkS") (width 0.1778) (fill none) (tstamp a8233e6c-65a8-45fa-bdff-0d885e21b244))
  (fp_rect (start 11.684 -0.508) (end 12.192 0.762) (layer "F.SilkS") (width 0.1778) (fill none) (tstamp ab910f2b-e46a-486b-9990-caa89ecc3b72))
  (fp_rect (start -3.05 2.246) (end -2.95 2.5) (layer "F.SilkS") (width 0.1778) (fill none) (tstamp bc080b38-a188-49f2-bbc3-9279211aa6a1))
  (fp_rect (start -9.05 2.246) (end -8.95 2.5) (layer "F.SilkS") (width 0.1778) (fill none) (tstamp c29405f6-0b09-467b-b530-cb55ffb4e899))
  (fp_rect (start 2.95 2.246) (end 3.05 2.5) (layer "F.SilkS") (width 0.1778) (fill none) (tstamp d2423426-3e11-4bfd-af28-7ae73fc5be98))
  (fp_rect (start 4.95 2.246) (end 5.05 2.5) (layer "F.SilkS") (width 0.1778) (fill none) (tstamp e25e6472-0e97-4da4-ba1e-d95d5e6a04c1))
  (fp_rect (start 8.95 2.246) (end 9.05 2.5) (layer "F.SilkS") (width 0.1778) (fill none) (tstamp f74850d8-6c75-4f6e-8714-870dd631188e))
  (fp_rect (start -12.7 -2.286) (end 12.7 3.556) (layer "F.CrtYd") (width 0.0254) (fill none) (tstamp 0a05af44-03f7-47b4-a600-ae918828d066))
  (fp_line (start -10.668 -1.524) (end -11.938 -1.524) (layer "F.Fab") (width 0.1) (tstamp 6d4b45ff-41b5-4e3f-be5f-93440e43596e))
  (fp_line (start -11.938 -1.524) (end -11.938 -0.254) (layer "F.Fab") (width 0.1) (tstamp 97a26510-6b7d-4f41-bdcc-6495c7ca4557))
  (fp_rect (start -12.192 -1.778) (end 12.192 3.048) (layer "F.Fab") (width 0.1) (fill none) (tstamp 61519fbb-54dc-41cc-90c1-d4ac2d5d3ecd))
  (pad "1" thru_hole roundrect (at -10 0) (size 1.27 1.778) (drill 0.762) (layers *.Cu *.Mask) (roundrect_rratio 0.2) (tstamp d16fcdb9-2e13-46ab-b823-b654de0ba765))
  (pad "2" thru_hole oval (at -8 0) (size 1.27 1.778) (drill 0.762) (layers *.Cu *.Mask) (tstamp 558f953e-ac3a-47e5-9790-8e95ce817ec7))
  (pad "3" thru_hole oval (at -6 0) (size 1.27 1.778) (drill 0.762) (layers *.Cu *.Mask) (tstamp 61416865-f97c-47cd-9e87-43a4e069fa36))
  (pad "4" thru_hole oval (at -4 0) (size 1.27 1.778) (drill 0.762) (layers *.Cu *.Mask) (tstamp 5a30305c-f48d-4f02-9a01-873d58c8f564))
  (pad "5" thru_hole oval (at -2 0) (size 1.27 1.778) (drill 0.762) (layers *.Cu *.Mask) (tstamp bc4bee99-d4a5-4ab2-a9d1-a694572ce9ed))
  (pad "6" thru_hole oval (at 0 0) (size 1.27 1.778) (drill 0.762) (layers *.Cu *.Mask) (tstamp 5327fe4d-ba0b-4cd2-93af-7c815b9a7699))
  (pad "7" thru_hole oval (at 2 0) (size 1.27 1.778) (drill 0.762) (layers *.Cu *.Mask) (tstamp cd642aef-c9df-4625-befc-67d019fcd6ee))
  (pad "8" thru_hole oval (at 4 0) (size 1.27 1.778) (drill 0.762) (layers *.Cu *.Mask) (tstamp 9dacba7c-5899-496e-89ee-1bb62bf4114c))
  (pad "9" thru_hole oval (at 6 0) (size 1.27 1.778) (drill 0.762) (layers *.Cu *.Mask) (tstamp 7648f52b-3f58-4db2-a4dd-31c57f0691d7))
  (pad "10" thru_hole oval (at 8 0) (size 1.27 1.778) (drill 0.762) (layers *.Cu *.Mask) (tstamp 68085d9e-ddce-4a8f-86e9-b1b419a59a14))
  (pad "11" thru_hole oval (at 10 0) (size 1.27 1.778) (drill 0.762) (layers *.Cu *.Mask) (tstamp 96e1eeec-0af6-4633-bcfc-750846959bbf))
  (model "${KICAD6_3DMODEL_DIR}/Connector_JST.3dshapes/JST_PH_B11B-PH-K_1x11_P2.00mm_Vertical.wrl"
    (offset (xyz -10 0 0))
    (scale (xyz 1 1 1))
    (rotate (xyz 0 0 0))
  )
)
