(footprint "IDC_P2.54_2x10" (version 20210722) (generator pcbnew) (layer "F.Cu")
  (tedit 6176BF06)
  (descr "Through hole IDC box header, 2x10, 2.54mm pitch, DIN 41651 / IEC 60603-13, double rows, https://docs.google.com/spreadsheets/d/16SsEcesNF15N3Lb4niX7dcUr-NY5_MFPQhobNuNppn4/edit#gid=0")
  (tags "Through hole vertical IDC box header THT 2x10 2.54mm double row")
  (attr through_hole)
  (fp_text reference "REF**" (at 0 0 90) (layer "F.SilkS")
    (effects (font (size 1.016 1.016) (thickness 0.1778)))
    (tstamp d2c28d74-7f25-4e6b-9b68-08d4eea534e8)
  )
  (fp_text value "IDC_P2.54_2x10" (at 0 0 90) (layer "F.Fab")
    (effects (font (size 1 1) (thickness 0.15)))
    (tstamp 3c9c7d73-2bba-4e51-91d0-a290106c68f1)
  )
  (fp_text user "${REFERENCE}" (at 0 -0.254 90) (layer "F.Fab")
    (effects (font (size 1 1) (thickness 0.15)))
    (tstamp 5e818788-8a32-434b-8e7b-4d8f21dbf53a)
  )
  (fp_line (start -3.302 15.24) (end -3.302 2.032) (layer "F.SilkS") (width 0.1778) (tstamp 117b1500-59be-46c5-abdf-dc95b026cc8c))
  (fp_line (start -4.572 -2.032) (end -3.302 -2.032) (layer "F.SilkS") (width 0.1778) (tstamp 431cee20-b2b3-4d7e-b034-65d9d8721f8e))
  (fp_line (start 3.302 15.24) (end -3.302 15.24) (layer "F.SilkS") (width 0.1778) (tstamp 4a7c4847-84c0-4b54-b8fe-a98255758ba7))
  (fp_line (start 3.302 -15.24) (end 3.302 15.24) (layer "F.SilkS") (width 0.1778) (tstamp 70195e9d-fea3-4ba6-9d95-abd456132659))
  (fp_line (start -3.302 -2.032) (end -3.302 -15.24) (layer "F.SilkS") (width 0.1778) (tstamp 792a95b5-2195-4f53-82a9-90ace482e1dd))
  (fp_line (start -3.302 -15.24) (end 3.302 -15.24) (layer "F.SilkS") (width 0.1778) (tstamp ae6993db-b4bd-4a1c-8d95-9f29523ff38c))
  (fp_line (start -3.302 2.032) (end -4.572 2.032) (layer "F.SilkS") (width 0.1778) (tstamp d3c26ab8-82e9-47b5-8adc-98c68ed2b82f))
  (fp_rect (start -4.572 -16.51) (end 4.572 16.51) (layer "F.SilkS") (width 0.1778) (fill none) (tstamp 62abc25e-5b0d-4458-bcc7-51c38f776473))
  (fp_poly (pts
      (xy -5.08 -11.43)
      (xy -5.842 -10.922)
      (xy -5.842 -11.938)
    ) (layer "F.SilkS") (width 0.1) (fill solid) (tstamp cdb5d33f-9ca1-4357-87e0-a9b590868ea7))
  (fp_rect (start -5.08 -17.018) (end 5.08 17.018) (layer "F.CrtYd") (width 0.0254) (fill none) (tstamp b6b70632-f0bd-4950-bfc8-4611ea7a72a1))
  (fp_line (start -4.572 2.032) (end -4.572 16.51) (layer "F.Fab") (width 0.1) (tstamp 2024e107-16b4-4280-87c2-4f557ec0bd14))
  (fp_line (start -3.302 15.24) (end 3.302 15.24) (layer "F.Fab") (width 0.1) (tstamp 23af2728-1957-4c99-ad94-6d1623f26755))
  (fp_line (start -3.302 -15.24) (end 3.302 -15.24) (layer "F.Fab") (width 0.1) (tstamp 3a738504-bd7f-43f5-ad5b-c7190577a5b9))
  (fp_line (start -3.302 -16.51) (end 4.572 -16.51) (layer "F.Fab") (width 0.1) (tstamp 4a6ba236-ecb6-4bb9-b478-0de3c88c9b13))
  (fp_line (start -4.572 -15.24) (end -3.302 -16.51) (layer "F.Fab") (width 0.1) (tstamp 4cfa7f4c-7f0c-4c17-ac9a-b09e672acb3e))
  (fp_line (start -3.302 15.24) (end -3.302 2.032) (layer "F.Fab") (width 0.1) (tstamp 8ac3a334-9859-45e7-ab1d-c95bb5f84d6a))
  (fp_line (start -3.302 -2.032) (end -3.302 -15.24) (layer "F.Fab") (width 0.1) (tstamp 8c0d070d-9d7f-471f-a77a-40d31294ec48))
  (fp_line (start -4.572 2.032) (end -3.302 2.032) (layer "F.Fab") (width 0.1) (tstamp 94bc54f0-582a-4c2a-a0a5-102f20b16bd2))
  (fp_line (start 3.302 15.24) (end 3.302 -15.24) (layer "F.Fab") (width 0.1) (tstamp a7bf139d-4a98-49e8-9225-e0fc10d5808f))
  (fp_line (start 4.572 -16.51) (end 4.572 16.51) (layer "F.Fab") (width 0.1) (tstamp abfde91b-6b03-450a-b135-25fec81bfb8b))
  (fp_line (start -4.572 -2.032) (end -4.572 -15.24) (layer "F.Fab") (width 0.1) (tstamp c71d1e40-22d9-452d-96ea-33781253e9c9))
  (fp_line (start 4.572 16.51) (end -4.572 16.51) (layer "F.Fab") (width 0.1) (tstamp d27df590-bc26-405b-b1ed-b7649ccc5875))
  (fp_line (start -4.572 -2.032) (end -3.302 -2.032) (layer "F.Fab") (width 0.1) (tstamp e7a76a07-675a-43f8-9dc3-b563e1a810bf))
  (pad "1" thru_hole roundrect locked (at -1.27 -11.43) (size 1.778 1.778) (drill 1.016) (layers *.Cu *.Mask) (roundrect_rratio 0.15) (tstamp ce86da1d-e4b5-4fe1-9d6f-cc917dfa67fc))
  (pad "2" thru_hole circle locked (at 1.27 -11.43) (size 1.778 1.778) (drill 1.016) (layers *.Cu *.Mask) (tstamp 43a83eba-af76-4719-9c2c-a2923112b0a9))
  (pad "3" thru_hole circle locked (at -1.27 -8.89) (size 1.778 1.778) (drill 1.016) (layers *.Cu *.Mask) (tstamp f48d4f1a-10f0-447a-99e5-45744ac38f75))
  (pad "4" thru_hole circle (at 1.27 -8.89) (size 1.778 1.778) (drill 1.016) (layers *.Cu *.Mask) (tstamp 0ef552eb-b258-4a47-8c49-d4b5ab990971))
  (pad "5" thru_hole circle (at -1.27 -6.35) (size 1.778 1.778) (drill 1.016) (layers *.Cu *.Mask) (tstamp ddc8e8bb-ddd5-4c0f-8c14-d8374058a2a5))
  (pad "6" thru_hole circle (at 1.27 -6.35) (size 1.778 1.778) (drill 1.016) (layers *.Cu *.Mask) (tstamp 935e0879-ecb4-47af-800a-5f543ddb2ce0))
  (pad "7" thru_hole circle (at -1.27 -3.81) (size 1.778 1.778) (drill 1.016) (layers *.Cu *.Mask) (tstamp 2d7c1910-5dae-47f0-84e3-4c07698c4ef7))
  (pad "8" thru_hole circle (at 1.27 -3.81) (size 1.778 1.778) (drill 1.016) (layers *.Cu *.Mask) (tstamp 0d07e2d5-d2d9-4882-ba73-437f9d84cfd4))
  (pad "9" thru_hole circle (at -1.27 -1.27) (size 1.778 1.778) (drill 1.016) (layers *.Cu *.Mask) (tstamp 96cb9be5-2e1c-4ed9-9fa7-3ffdd7376064))
  (pad "10" thru_hole circle (at 1.27 -1.27) (size 1.778 1.778) (drill 1.016) (layers *.Cu *.Mask) (tstamp b4be09e6-a97c-4d5d-bd81-fae8e5840798))
  (pad "11" thru_hole circle (at -1.27 1.27) (size 1.778 1.778) (drill 1.016) (layers *.Cu *.Mask) (tstamp d72e03a1-5e39-45eb-8ea6-146355d0d8d4))
  (pad "12" thru_hole circle (at 1.27 1.27) (size 1.778 1.778) (drill 1.016) (layers *.Cu *.Mask) (tstamp 0c06c6b0-91c3-48eb-ba73-2674422e987c))
  (pad "13" thru_hole circle (at -1.27 3.81) (size 1.778 1.778) (drill 1.016) (layers *.Cu *.Mask) (tstamp 4e826566-10d8-4499-903e-794ce6b2c3f9))
  (pad "14" thru_hole circle (at 1.27 3.81) (size 1.778 1.778) (drill 1.016) (layers *.Cu *.Mask) (tstamp a377ce44-fe16-4eb6-8da9-30158293850d))
  (pad "15" thru_hole circle (at -1.27 6.35) (size 1.778 1.778) (drill 1.016) (layers *.Cu *.Mask) (tstamp ad8fd18d-b4d1-4d33-89d2-0947ed4bc918))
  (pad "16" thru_hole circle (at 1.27 6.35) (size 1.778 1.778) (drill 1.016) (layers *.Cu *.Mask) (tstamp dffab3ea-135c-4509-bf48-651cf70914f9))
  (pad "17" thru_hole circle (at -1.27 8.89) (size 1.778 1.778) (drill 1.016) (layers *.Cu *.Mask) (tstamp 082f991b-4ee4-4df5-8937-228b294237fc))
  (pad "18" thru_hole circle (at 1.27 8.89) (size 1.778 1.778) (drill 1.016) (layers *.Cu *.Mask) (tstamp c07ba9e8-4e2f-43c2-aa09-4346ddd2a118))
  (pad "19" thru_hole circle (at -1.27 11.43) (size 1.778 1.778) (drill 1.016) (layers *.Cu *.Mask) (tstamp 090bdc93-ef6b-4527-b40e-bddefa1b23fd))
  (pad "20" thru_hole circle (at 1.27 11.43) (size 1.778 1.778) (drill 1.016) (layers *.Cu *.Mask) (tstamp 7b7e2283-a672-4666-ae2b-4f3307414a7d))
  (model "${KICAD6_3DMODEL_DIR}/Connector_IDC.3dshapes/IDC-Header_2x10_P2.54mm_Vertical.wrl"
    (offset (xyz -1.27 11.43 0))
    (scale (xyz 1 1 1))
    (rotate (xyz 0 0 0))
  )
)
