(footprint "HDR_P2.54_1x10_RA" (version 20210722) (generator pcbnew) (layer "F.Cu")
  (tedit 6176BD5C)
  (descr "Through hole angled pin header, 1x10, 2.54mm pitch, 6mm pin length, single row")
  (tags "Through hole angled pin header THT 1x10 2.54mm single row")
  (attr through_hole)
  (fp_text reference "REF**" (at 0 0 90) (layer "F.SilkS")
    (effects (font (size 1.016 1.016) (thickness 0.1778)))
    (tstamp 518048c9-d164-47ad-90cd-70faababa4cd)
  )
  (fp_text value "HDR_P2.54_1x10_RA" (at 2.794 0 90) (layer "F.Fab")
    (effects (font (size 1 1) (thickness 0.15)))
    (tstamp 12ad866c-dfbc-4a1d-bd40-ccd4ecd24b39)
  )
  (fp_text user "${REFERENCE}" (at 2.794 -0.066 90) (layer "F.Fab")
    (effects (font (size 1 1) (thickness 0.15)))
    (tstamp 89314cca-126c-4f4a-a4e5-f29f2a166de2)
  )
  (fp_line (start 1.016 1.524) (end 1.524 1.524) (layer "F.SilkS") (width 0.1778) (tstamp 03af1776-df0a-4432-b59e-2e848c611f32))
  (fp_line (start 1.016 9.144) (end 1.524 9.144) (layer "F.SilkS") (width 0.1778) (tstamp 0c05c14d-e611-4964-85bf-cca54f68f286))
  (fp_line (start 1.016 -8.636) (end 1.524 -8.636) (layer "F.SilkS") (width 0.1778) (tstamp 0d567ef0-ff84-4311-a519-3b4995b42b4b))
  (fp_line (start 1.016 -1.016) (end 1.524 -1.016) (layer "F.SilkS") (width 0.1778) (tstamp 0dd54c02-185e-42ee-aa34-60996fc80301))
  (fp_line (start 1.016 -11.176) (end 1.524 -11.176) (layer "F.SilkS") (width 0.1778) (tstamp 1483950e-4eff-4552-a0a6-e22c700aa2af))
  (fp_line (start 1.016 -1.524) (end 1.524 -1.524) (layer "F.SilkS") (width 0.1778) (tstamp 28f14735-63b3-4bb1-9897-dc151504cb6f))
  (fp_line (start 1.016 6.604) (end 1.524 6.604) (layer "F.SilkS") (width 0.1778) (tstamp 2d508d68-23d3-4c05-9be4-31a80958fb88))
  (fp_line (start -1.27 -11.43) (end -1.27 -12.7) (layer "F.SilkS") (width 0.1778) (tstamp 2fd7201e-8535-48aa-bdb5-e055f7e764ff))
  (fp_line (start 1.016 -4.064) (end 1.524 -4.064) (layer "F.SilkS") (width 0.1778) (tstamp 31df7443-04a3-44c5-bdb9-bf36aaff5f11))
  (fp_line (start 1.016 -9.144) (end 1.524 -9.144) (layer "F.SilkS") (width 0.1778) (tstamp 3eb11823-4490-4fd6-aef2-e998ecf5a888))
  (fp_line (start 1.016 -11.684) (end 1.524 -11.684) (layer "F.SilkS") (width 0.1778) (tstamp 3f012b9d-5e17-4f81-9130-f7fc0b35a8cf))
  (fp_line (start 1.016 11.176) (end 1.524 11.176) (layer "F.SilkS") (width 0.1778) (tstamp 64bd2c2e-d4d9-41b4-89d5-e25b5e52427f))
  (fp_line (start 1.016 -3.556) (end 1.524 -3.556) (layer "F.SilkS") (width 0.1778) (tstamp 7986b3d4-1b4f-4c41-a5f1-1e6dacbc8949))
  (fp_line (start 1.016 11.684) (end 1.524 11.684) (layer "F.SilkS") (width 0.1778) (tstamp 8bfecd92-e585-4b72-b04f-69865297ab6a))
  (fp_line (start 1.016 8.636) (end 1.524 8.636) (layer "F.SilkS") (width 0.1778) (tstamp 9b0e5529-1ae1-4da5-9408-1db95044cb16))
  (fp_line (start -1.27 -12.7) (end 0 -12.7) (layer "F.SilkS") (width 0.1778) (tstamp baa530b6-e9a5-403a-a3a6-ed4fb8aa5450))
  (fp_line (start 1.016 -6.604) (end 1.524 -6.604) (layer "F.SilkS") (width 0.1778) (tstamp bf49bbdd-5f8a-4ff5-9580-20a80896bc41))
  (fp_line (start 1.016 4.064) (end 1.524 4.064) (layer "F.SilkS") (width 0.1778) (tstamp c7be48cb-0cc1-4e9c-a4ec-e9888be8d519))
  (fp_line (start 1.016 1.016) (end 1.524 1.016) (layer "F.SilkS") (width 0.1778) (tstamp c868a8e7-7e43-4646-a669-6ded78875692))
  (fp_line (start 1.016 3.556) (end 1.524 3.556) (layer "F.SilkS") (width 0.1778) (tstamp e2028b14-bea6-470b-80e4-4870f8197140))
  (fp_line (start 1.016 -6.096) (end 1.524 -6.096) (layer "F.SilkS") (width 0.1778) (tstamp f3a9b77a-aae3-4aa1-af9a-2c5e1aa6d445))
  (fp_line (start 1.016 6.096) (end 1.524 6.096) (layer "F.SilkS") (width 0.1778) (tstamp f630e2a2-d744-471f-88a4-dab1b627ce74))
  (fp_rect (start 1.524 7.62) (end 4.064 5.08) (layer "F.SilkS") (width 0.1778) (fill none) (tstamp 0843cdcd-b8de-4664-80be-a07d9824d6fe))
  (fp_rect (start 4.064 -6.604) (end 10.16 -6.096) (layer "F.SilkS") (width 0.1778) (fill none) (tstamp 0a7e880a-9a77-46e6-9b84-f94722bcb3fa))
  (fp_rect (start 4.064 8.636) (end 10.16 9.144) (layer "F.SilkS") (width 0.1778) (fill none) (tstamp 17bb7889-0387-487b-bba8-3738888f7741))
  (fp_rect (start 1.524 -7.62) (end 4.064 -10.16) (layer "F.SilkS") (width 0.1778) (fill none) (tstamp 1a8ce0dc-2f5a-429e-97c8-dc00788ce66a))
  (fp_rect (start 4.064 -11.684) (end 10.16 -11.176) (layer "F.SilkS") (width 0.1778) (fill solid) (tstamp 1dc852a8-5ecf-4495-8955-11b6b94a91cc))
  (fp_rect (start 1.524 10.16) (end 4.064 7.62) (layer "F.SilkS") (width 0.1778) (fill none) (tstamp 2ddf2ea1-19b6-4c3a-9d5a-dcef736b7c18))
  (fp_rect (start 1.524 0) (end 4.064 -2.54) (layer "F.SilkS") (width 0.1778) (fill none) (tstamp 38267019-fa37-46aa-afed-02f490a64d75))
  (fp_rect (start 1.524 5.08) (end 4.064 2.54) (layer "F.SilkS") (width 0.1778) (fill none) (tstamp 501d8560-c3b0-4fcd-8913-cda30785b75a))
  (fp_rect (start 4.064 1.016) (end 10.16 1.524) (layer "F.SilkS") (width 0.1778) (fill none) (tstamp 5ae4148a-08ff-4d4e-911f-d54065ed71a2))
  (fp_rect (start 1.524 2.54) (end 4.064 0) (layer "F.SilkS") (width 0.1778) (fill none) (tstamp 6cd396ec-afce-4999-8e9c-1abcf2fc994a))
  (fp_rect (start 1.524 -2.54) (end 4.064 -5.08) (layer "F.SilkS") (width 0.1778) (fill none) (tstamp 7607ce90-0f7d-43f8-979b-d9cf561db696))
  (fp_rect (start 1.524 12.7) (end 4.064 10.16) (layer "F.SilkS") (width 0.1778) (fill none) (tstamp 80127804-d4bb-46e6-94b5-31e8fd57dbf2))
  (fp_rect (start 4.064 6.096) (end 10.16 6.604) (layer "F.SilkS") (width 0.1778) (fill none) (tstamp 962d0d6e-b6ae-4f6c-ae54-d034f4d2caa1))
  (fp_rect (start 4.064 3.556) (end 10.16 4.064) (layer "F.SilkS") (width 0.1778) (fill none) (tstamp ac35bd29-4bc8-43fd-a7b8-1de3d6594231))
  (fp_rect (start 1.524 -10.16) (end 4.064 -12.7) (layer "F.SilkS") (width 0.1778) (fill none) (tstamp b51a20e1-22c7-43a1-9dc5-031239aae883))
  (fp_rect (start 4.064 -1.524) (end 10.16 -1.016) (layer "F.SilkS") (width 0.1778) (fill none) (tstamp c749616e-d632-42aa-9227-2040c2b43f63))
  (fp_rect (start 4.064 11.176) (end 10.16 11.684) (layer "F.SilkS") (width 0.1778) (fill none) (tstamp db219b6f-798a-4ea9-b8e2-ea028dec5eee))
  (fp_rect (start 1.524 -5.08) (end 4.064 -7.62) (layer "F.SilkS") (width 0.1778) (fill none) (tstamp dfc76734-0886-40ef-bcd4-b47cb90a8ecd))
  (fp_rect (start 4.064 -9.144) (end 10.16 -8.636) (layer "F.SilkS") (width 0.1778) (fill none) (tstamp f1ed29af-ed4b-40e0-9983-820fff1bc0b7))
  (fp_rect (start 4.064 -4.064) (end 10.16 -3.556) (layer "F.SilkS") (width 0.1778) (fill none) (tstamp fb79c117-33a0-49e1-8bbd-dc09e86f5eb2))
  (fp_rect (start -1.778 -13.208) (end 10.668 13.208) (layer "F.CrtYd") (width 0.0254) (fill none) (tstamp 822ec5c7-a048-433f-af54-73d172ebda80))
  (fp_line (start 1.524 -12.192) (end 2.032 -12.7) (layer "F.Fab") (width 0.1) (tstamp 1910e8ce-867b-462d-bc60-77464ad6b19a))
  (fp_line (start 2.032 -12.7) (end 4.064 -12.7) (layer "F.Fab") (width 0.1) (tstamp 46a89712-fbbf-4ed4-8808-f367db3b893e))
  (fp_line (start 4.064 -12.7) (end 4.064 12.7) (layer "F.Fab") (width 0.1) (tstamp a6da82da-25a3-4d8a-90ed-2a8955c0c41f))
  (fp_line (start 1.524 12.7) (end 1.524 -12.192) (layer "F.Fab") (width 0.1) (tstamp c294a2f4-f7bc-4356-bcc7-26adb06d15ee))
  (fp_line (start 4.064 12.7) (end 1.524 12.7) (layer "F.Fab") (width 0.1) (tstamp c508e62e-7298-4fae-a935-5f6c40b1df69))
  (fp_rect (start -0.254 -6.604) (end 1.524 -6.096) (layer "F.Fab") (width 0.1) (fill none) (tstamp 0c8b3032-5404-4754-a154-693b80b33418))
  (fp_rect (start -0.254 11.684) (end 1.524 11.176) (layer "F.Fab") (width 0.1) (fill none) (tstamp 0cafa9ad-1c19-48d4-94d5-c9c0842ae394))
  (fp_rect (start -0.254 -9.144) (end 1.524 -8.636) (layer "F.Fab") (width 0.1) (fill none) (tstamp 11dbe839-b1c0-4f89-a826-345c66623740))
  (fp_rect (start -0.254 1.524) (end 1.524 1.016) (layer "F.Fab") (width 0.1) (fill none) (tstamp 15a85150-1ab9-4dc1-8bbb-f727c5942704))
  (fp_rect (start -0.254 3.556) (end 1.524 4.064) (layer "F.Fab") (width 0.1) (fill none) (tstamp 1c41f040-56b5-4349-a86a-6d49c47c727d))
  (fp_rect (start 4.064 -6.604) (end 10.16 -6.096) (layer "F.Fab") (width 0.1) (fill none) (tstamp 3eabb3ea-8423-4d2a-be7d-f73ba234cf76))
  (fp_rect (start 4.064 8.636) (end 10.16 9.144) (layer "F.Fab") (width 0.1) (fill none) (tstamp 4f94f151-2db9-48f8-a1a1-8b3bfda1ea39))
  (fp_rect (start -0.254 9.144) (end 1.524 8.636) (layer "F.Fab") (width 0.1) (fill none) (tstamp 567d4e2e-6715-47c9-bbec-0a7c572dc389))
  (fp_rect (start 4.064 6.096) (end 10.16 6.604) (layer "F.Fab") (width 0.1) (fill none) (tstamp 79a9e9a3-e280-4331-94cf-25b7bc8731b4))
  (fp_rect (start 4.064 3.556) (end 10.16 4.064) (layer "F.Fab") (width 0.1) (fill none) (tstamp 7e44e286-14f7-49c3-b6f6-a550f5f5d581))
  (fp_rect (start -0.254 -1.524) (end 1.524 -1.016) (layer "F.Fab") (width 0.1) (fill none) (tstamp 7e69f543-5fb1-45d7-baea-716f197a9652))
  (fp_rect (start -0.254 -4.064) (end 1.524 -3.556) (layer "F.Fab") (width 0.1) (fill none) (tstamp 8a0834a6-959b-46f9-bbf0-aaebcbeef41a))
  (fp_rect (start -0.254 -11.684) (end 1.524 -11.176) (layer "F.Fab") (width 0.1) (fill none) (tstamp a05f2d3d-dd44-422e-8ed5-bc516d0ddb0f))
  (fp_rect (start 4.064 -1.524) (end 10.16 -1.016) (layer "F.Fab") (width 0.1) (fill none) (tstamp a570c1b7-263b-49cd-b196-a212618220a0))
  (fp_rect (start 4.064 -11.684) (end 10.16 -11.176) (layer "F.Fab") (width 0.1) (fill none) (tstamp d358dc60-e84c-4741-bd87-72cad100dd0a))
  (fp_rect (start -0.254 6.604) (end 1.524 6.096) (layer "F.Fab") (width 0.1) (fill none) (tstamp d36cac3c-7d70-4e8b-a902-593c691c803f))
  (fp_rect (start 4.064 -9.144) (end 10.16 -8.636) (layer "F.Fab") (width 0.1) (fill none) (tstamp ebc8e941-b498-4ece-bc9d-0bdbeac90425))
  (fp_rect (start 4.064 1.016) (end 10.16 1.524) (layer "F.Fab") (width 0.1) (fill none) (tstamp ee143c63-3c0a-40e9-b0c2-82c13e139960))
  (fp_rect (start 4.064 -4.064) (end 10.16 -3.556) (layer "F.Fab") (width 0.1) (fill none) (tstamp fb0d00f3-758f-4071-aae3-e0c38a4dd18f))
  (fp_rect (start 4.064 11.176) (end 10.16 11.684) (layer "F.Fab") (width 0.1) (fill none) (tstamp ff13456a-68eb-455e-9896-07477ab8deb9))
  (pad "1" thru_hole roundrect locked (at 0 -11.43) (size 2.032 1.778) (drill 1.016) (layers *.Cu *.Mask) (roundrect_rratio 0.1) (tstamp da072ec8-8556-4e7e-aae4-7df36a72c599))
  (pad "2" thru_hole oval locked (at 0 -8.89) (size 2.032 1.778) (drill 1.016) (layers *.Cu *.Mask) (tstamp 680c423c-0e58-4ad3-948c-8c739f58bfe3))
  (pad "3" thru_hole oval locked (at 0 -6.35) (size 2.032 1.778) (drill 1.016) (layers *.Cu *.Mask) (tstamp f54b9953-c480-4dd0-9edd-e595f37ce108))
  (pad "4" thru_hole oval (at 0 -3.81) (size 2.032 1.778) (drill 1.016) (layers *.Cu *.Mask) (tstamp 34380489-43fe-4c57-9497-3a8d547a9751))
  (pad "5" thru_hole oval (at 0 -1.27) (size 2.032 1.778) (drill 1.016) (layers *.Cu *.Mask) (tstamp 2e9300b9-7957-4b3c-aa2c-57e36deeedc3))
  (pad "6" thru_hole oval (at 0 1.27) (size 2.032 1.778) (drill 1.016) (layers *.Cu *.Mask) (tstamp 319d529c-1f24-45e9-a582-25fb52d9fda9))
  (pad "7" thru_hole oval (at 0 3.81) (size 2.032 1.778) (drill 1.016) (layers *.Cu *.Mask) (tstamp f64771d7-db1b-4b29-b3b1-04a607c729cf))
  (pad "8" thru_hole oval (at 0 6.35) (size 2.032 1.778) (drill 1.016) (layers *.Cu *.Mask) (tstamp b5f0f67c-6665-4eb9-8f1a-c8540f11e2a2))
  (pad "9" thru_hole oval (at 0 8.89) (size 2.032 1.778) (drill 1.016) (layers *.Cu *.Mask) (tstamp 0729237c-30b8-4025-b9ee-b1c90eee0be5))
  (pad "10" thru_hole oval (at 0 11.43) (size 2.032 1.778) (drill 1.016) (layers *.Cu *.Mask) (tstamp fca5a60c-210b-49c2-9494-7c1dce870a37))
  (model "${KICAD6_3DMODEL_DIR}/Connector_PinHeader_2.54mm.3dshapes/PinHeader_1x10_P2.54mm_Horizontal.wrl"
    (offset (xyz 0 11.43 0))
    (scale (xyz 1 1 1))
    (rotate (xyz 0 0 0))
  )
)
