(footprint "B0805" (version 20211014) (generator pcbnew)
  (layer "F.Cu")
  (tedit 61A59760)
  (tags "capacitor")
  (attr smd)
  (fp_text reference "REF**" (at 0 -2.032) (layer "F.SilkS")
    (effects (font (size 1.016 1.016) (thickness 0.1778)))
    (tstamp f4bc8d1a-c35f-43eb-a6ad-e5caac707cc1)
  )
  (fp_text value "B0805" (at 0 2.032) (layer "F.Fab")
    (effects (font (size 1.016 1.016) (thickness 0.1778)))
    (tstamp a5fd4310-fc59-47d4-8b6f-24e783e4454a)
  )
  (fp_text user "${REFERENCE}" (at 0 0) (layer "F.Fab")
    (effects (font (size 1.016 1.016) (thickness 0.1778)))
    (tstamp 39b44c4c-e7fa-42b9-be06-3806c8ebc304)
  )
  (fp_text user "Footprint: 0805 (2012 Metric)" (at 0 5.08 unlocked) (layer "User.1")
    (effects (font (size 1.016 1.016) (thickness 0.1778) italic) (justify left))
    (tstamp 050bef9f-8b0d-49ba-8ed6-7838b15dc076)
  )
  (fp_text user "Dimension: 2.0x1.25mm" (at 0 7.112 unlocked) (layer "User.1")
    (effects (font (size 1.016 1.016) (thickness 0.1778) italic) (justify left))
    (tstamp 677c60cc-e276-4773-b00e-2725cf19f1f4)
  )
  (fp_text user "Auth: Thanh Duong" (at 0 9.144 unlocked) (layer "User.1")
    (effects (font (size 1.016 1.016) (thickness 0.1778) italic) (justify left))
    (tstamp f00236fc-8623-4f86-93ca-603ec6db4c95)
  )
  (fp_line (start 1.143 -0.889002) (end 1.397 -0.635) (layer "F.SilkS") (width 0.1778) (tstamp 0ba91143-e804-4cf5-9cc8-5ce34a78bd9b))
  (fp_line (start 1.143 0.888998) (end 1.397 0.635) (layer "F.SilkS") (width 0.1778) (tstamp 12b42de3-4fc8-47e4-acd6-f5e336a3833f))
  (fp_line (start 1.397 -0.635) (end 1.397 0.635) (layer "F.SilkS") (width 0.1778) (tstamp 1e92619b-548e-4049-bb5f-dbb0483bc162))
  (fp_line (start -1.397 -0.635) (end -1.143 -0.888998) (layer "F.SilkS") (width 0.1778) (tstamp 236c5635-6914-42b8-b352-1526be9e9fb4))
  (fp_line (start 0.508 -0.889) (end 1.143 -0.889002) (layer "F.SilkS") (width 0.1778) (tstamp 617c0aac-448c-4e53-89db-c064d51ef7fd))
  (fp_line (start -1.143 0.889002) (end -1.397 0.635) (layer "F.SilkS") (width 0.1778) (tstamp 69998110-cdd1-44a0-aebb-d987f83f941c))
  (fp_line (start -1.397 -0.635) (end -1.397 0.635) (layer "F.SilkS") (width 0.1778) (tstamp 7f44d176-5d1b-4066-afeb-37b1a4b37a2d))
  (fp_line (start -1.143 0.889002) (end -0.508 0.889) (layer "F.SilkS") (width 0.1778) (tstamp 801a82f7-3d4f-4673-9460-88f1123e44f7))
  (fp_line (start -1.143 -0.888998) (end -0.508 -0.889) (layer "F.SilkS") (width 0.1778) (tstamp 9d33ebe2-94ff-46c0-8021-2b6ef289e87d))
  (fp_line (start 0.508 0.889) (end 1.143 0.888998) (layer "F.SilkS") (width 0.1778) (tstamp c4e8e1d7-db0b-42f4-869f-1a8619764104))
  (fp_rect (start -1.397 -0.889) (end 1.397 0.889) (layer "F.CrtYd") (width 0.0254) (fill none) (tstamp 2fb121d2-db72-47f0-8a96-e5c06a269363))
  (fp_rect (start -1 -0.625) (end 1 0.625) (layer "F.Fab") (width 0.1) (fill none) (tstamp 49b50f81-7a52-4940-b68f-ea39babb7f76))
  (pad "1" smd rect (at -0.762 0) (size 0.9398 1.3462) (layers "F.Cu" "F.Paste" "F.Mask")
    (solder_mask_margin 0.0762) (tstamp e9b8ddec-f586-405b-905d-71736cae2810))
  (pad "2" smd rect (at 0.762 0) (size 0.9398 1.3462) (layers "F.Cu" "F.Paste" "F.Mask")
    (solder_mask_margin 0.0762) (tstamp b0eeeff6-7015-4223-b0f3-0d6ab63f20dd))
  (model "${KICAD6_3DMODEL_DIR}/Inductor_SMD.3dshapes/L_0805_2012Metric.step"
    (offset (xyz 0 0 0))
    (scale (xyz 1 1 1))
    (rotate (xyz 0 0 0))
  )
)
