(footprint "HDR_P2.54_1x11" (version 20210722) (generator pcbnew) (layer "F.Cu")
  (tedit 6176BD6E)
  (descr "Through hole straight pin header, 1x20, 2.54mm pitch, single row")
  (tags "Through hole pin header THT 1x20 2.54mm single row")
  (attr through_hole)
  (fp_text reference "REF**" (at 0 0 90) (layer "F.SilkS")
    (effects (font (size 1.016 1.016) (thickness 0.1778)))
    (tstamp 75402760-3f4c-40a2-a361-2b78969fab0a)
  )
  (fp_text value "HDR_P2.54_1x11" (at 0 0 90) (layer "F.Fab")
    (effects (font (size 1 1) (thickness 0.15)))
    (tstamp 89338641-569a-403f-9789-1022a95adab5)
  )
  (fp_text user "${REFERENCE}" (at 0 0 90) (layer "F.Fab")
    (effects (font (size 1 1) (thickness 0.15)))
    (tstamp 9e9b57b8-4e09-4ffb-b2e7-deb165a58870)
  )
  (fp_line (start 1.27 -13.97) (end 1.27 13.97) (layer "F.SilkS") (width 0.1778) (tstamp 0c466eef-b79b-4f49-8353-8516771a16be))
  (fp_line (start -1.27 -13.97) (end -1.27 13.97) (layer "F.SilkS") (width 0.1778) (tstamp 2c71cba5-07b0-4550-aa39-b7dda7ac3180))
  (fp_line (start -1.27 -13.462) (end -0.762 -13.97) (layer "F.SilkS") (width 0.1778) (tstamp 6b2c5cb3-216a-46dd-b8e9-4cb607bf63ad))
  (fp_line (start -1.27 13.97) (end 1.27 13.97) (layer "F.SilkS") (width 0.1778) (tstamp b4261fee-2c85-4da5-abdf-8efbe1a4a82a))
  (fp_line (start -1.27 -13.97) (end 1.27 -13.97) (layer "F.SilkS") (width 0.1778) (tstamp d5d346cf-9d26-45ce-8459-0b2a09f973ac))
  (fp_rect (start -1.778 -14.478) (end 1.778 14.478) (layer "F.CrtYd") (width 0.0254) (fill none) (tstamp 4644016d-7bcc-4fae-bd23-65c9dccda595))
  (fp_line (start 1.27 -13.97) (end 1.27 13.97) (layer "F.Fab") (width 0.1) (tstamp 48aa2aba-17da-41c7-8737-9085989c1345))
  (fp_line (start -1.27 13.97) (end -1.27 -13.462) (layer "F.Fab") (width 0.1) (tstamp 67e5e6db-cf0b-4433-b732-3a6737bac1b7))
  (fp_line (start 1.27 13.97) (end -1.27 13.97) (layer "F.Fab") (width 0.1) (tstamp 6a70d147-0e7c-4295-bf2a-7d40d71302ab))
  (fp_line (start -0.762 -13.97) (end 1.27 -13.97) (layer "F.Fab") (width 0.1) (tstamp 9ea0e9e4-e060-42ac-8174-c7e51eff107e))
  (fp_line (start -1.27 -13.462) (end -0.762 -13.97) (layer "F.Fab") (width 0.1) (tstamp ba5e4187-6ed4-45e7-91d3-7a9e410562c5))
  (pad "1" thru_hole roundrect locked (at 0 -12.7) (size 2.032 1.778) (drill 1.016) (layers *.Cu *.Mask) (roundrect_rratio 0.1) (tstamp 30c2fdd6-bdf3-43c0-bcd1-5bf67bdcd0e5))
  (pad "2" thru_hole oval locked (at 0 -10.16) (size 2.032 1.778) (drill 1.016) (layers *.Cu *.Mask) (tstamp 87f07fd5-1e4b-4c38-bb3b-a528a02aa8b2))
  (pad "3" thru_hole oval locked (at 0 -7.62) (size 2.032 1.778) (drill 1.016) (layers *.Cu *.Mask) (tstamp 13c15d0e-ffb8-4501-ac23-7c8523f64283))
  (pad "4" thru_hole oval locked (at 0 -5.207) (size 2.032 1.778) (drill 1.016) (layers *.Cu *.Mask) (tstamp 65aa8481-a571-4d34-9233-695ecbaa2594))
  (pad "5" thru_hole oval (at 0 -2.54) (size 2.032 1.778) (drill 1.016) (layers *.Cu *.Mask) (tstamp c1a5f962-5634-41f8-b417-a4a17e86a134))
  (pad "6" thru_hole oval (at 0 0) (size 2.032 1.778) (drill 1.016) (layers *.Cu *.Mask) (tstamp 5b617ff1-383e-43bc-be80-f87538390347))
  (pad "7" thru_hole oval (at 0 2.54) (size 2.032 1.778) (drill 1.016) (layers *.Cu *.Mask) (tstamp 8cbe1d92-c08b-4419-ae85-51e36dd2a787))
  (pad "8" thru_hole oval (at 0 5.08) (size 2.032 1.778) (drill 1.016) (layers *.Cu *.Mask) (tstamp ec45f9b1-ed25-4410-979e-19c22dc4e320))
  (pad "9" thru_hole oval (at 0 7.62) (size 2.032 1.778) (drill 1.016) (layers *.Cu *.Mask) (tstamp b7b4bc55-8797-47c5-ba5b-176077e3d809))
  (pad "10" thru_hole oval (at 0 10.16) (size 2.032 1.778) (drill 1.016) (layers *.Cu *.Mask) (tstamp aa155e7f-c8e3-4995-9758-50317660d8d8))
  (pad "11" thru_hole oval (at 0 12.7) (size 2.032 1.778) (drill 1.016) (layers *.Cu *.Mask) (tstamp 152e6bba-cd6d-4929-b300-7631ee39f65a))
  (model "${KICAD6_3DMODEL_DIR}/Connector_PinHeader_2.54mm.3dshapes/PinHeader_1x11_P2.54mm_Vertical.wrl"
    (offset (xyz 0 12.7 0))
    (scale (xyz 1 1 1))
    (rotate (xyz 0 0 0))
  )
)
