(footprint "HDR_P2.54_1x8" (version 20210722) (generator pcbnew) (layer "F.Cu")
  (tedit 6176BC56)
  (descr "Through hole straight pin header, 1x20, 2.54mm pitch, single row")
  (tags "Through hole pin header THT 1x20 2.54mm single row")
  (attr through_hole)
  (fp_text reference "REF**" (at 0 0 90) (layer "F.SilkS")
    (effects (font (size 1.016 1.016) (thickness 0.1778)))
    (tstamp 97a27c84-e7d0-44ba-b6ad-26d62202f4f6)
  )
  (fp_text value "HDR_P2.54_1x8" (at 0 0 90) (layer "F.Fab")
    (effects (font (size 1 1) (thickness 0.15)))
    (tstamp 9adb36d8-717c-428f-b5c2-e6d0b4c10834)
  )
  (fp_text user "${REFERENCE}" (at 0 0 90) (layer "F.Fab")
    (effects (font (size 1 1) (thickness 0.15)))
    (tstamp 6d051d80-ea68-42fc-9d87-140b93b32bd5)
  )
  (fp_line (start 1.27 -10.16) (end 1.27 10.16) (layer "F.SilkS") (width 0.1778) (tstamp 23122070-3886-41c2-a53b-b23ed35fb862))
  (fp_line (start -1.27 10.16) (end 1.27 10.16) (layer "F.SilkS") (width 0.1778) (tstamp 6de4e751-5696-4586-83d9-240b849eefb1))
  (fp_line (start -1.27 -9.652) (end -0.762 -10.16) (layer "F.SilkS") (width 0.1778) (tstamp 8929d6f5-b782-4eec-b032-66d70671e9fc))
  (fp_line (start -1.27 -10.16) (end 1.27 -10.16) (layer "F.SilkS") (width 0.1778) (tstamp b6015233-d1c7-4b19-9775-a4c05e6d206b))
  (fp_line (start -1.27 -10.16) (end -1.27 10.16) (layer "F.SilkS") (width 0.1778) (tstamp f50f6567-6e64-4533-a93b-a3a7016b82db))
  (fp_rect (start -1.778 -10.668) (end 1.778 10.668) (layer "F.CrtYd") (width 0.0254) (fill none) (tstamp 002ae72f-d68b-4176-9d73-67d93c8f28d4))
  (fp_line (start -1.27 10.16) (end -1.27 -9.652) (layer "F.Fab") (width 0.1) (tstamp 5993b8d2-dbc0-4679-aad4-f9fdf596dae6))
  (fp_line (start 1.27 -10.16) (end 1.27 10.16) (layer "F.Fab") (width 0.1) (tstamp 5d05256b-619c-4566-8c4e-38e55b3ae4b1))
  (fp_line (start -1.27 -9.652) (end -0.762 -10.16) (layer "F.Fab") (width 0.1) (tstamp 5fb2ccb5-c66b-483e-875c-02b83b6f92cf))
  (fp_line (start -0.762 -10.16) (end 1.27 -10.16) (layer "F.Fab") (width 0.1) (tstamp 71de3edf-525e-408f-bd19-b17856445ccf))
  (fp_line (start 1.27 10.16) (end -1.27 10.16) (layer "F.Fab") (width 0.1) (tstamp d66e407f-f222-497b-825d-3b6df09f5c18))
  (pad "1" thru_hole roundrect locked (at 0 -8.89) (size 2.032 1.778) (drill 1.016) (layers *.Cu *.Mask) (roundrect_rratio 0.1) (tstamp 6d50ad09-0e97-49ea-aa42-2fdd236245d3))
  (pad "2" thru_hole oval locked (at 0 -6.35) (size 2.032 1.778) (drill 1.016) (layers *.Cu *.Mask) (tstamp 3d5d5f9c-b467-4949-9918-b6e70294e683))
  (pad "3" thru_hole oval locked (at 0 -3.81) (size 2.032 1.778) (drill 1.016) (layers *.Cu *.Mask) (tstamp 8931d9ad-7c2b-47f4-b264-a5aa3630a9a1))
  (pad "4" thru_hole oval locked (at 0 -1.27) (size 2.032 1.778) (drill 1.016) (layers *.Cu *.Mask) (tstamp 1910e15f-a552-4384-b904-6d4f35290ec8))
  (pad "5" thru_hole oval (at 0 1.27) (size 2.032 1.778) (drill 1.016) (layers *.Cu *.Mask) (tstamp b4a55238-50de-4639-8cff-2765e2ca1dcc))
  (pad "6" thru_hole oval (at 0 3.81) (size 2.032 1.778) (drill 1.016) (layers *.Cu *.Mask) (tstamp 365fa839-9563-49e1-adf3-ba755935c7bf))
  (pad "7" thru_hole oval (at 0 6.35) (size 2.032 1.778) (drill 1.016) (layers *.Cu *.Mask) (tstamp 10bf556b-79b1-418e-ab43-d7e68c83cdfc))
  (pad "8" thru_hole oval (at 0 8.89) (size 2.032 1.778) (drill 1.016) (layers *.Cu *.Mask) (tstamp 6d854309-3679-4953-8c6e-95c8b28d8a6f))
  (model "${KICAD6_3DMODEL_DIR}/Connector_PinHeader_2.54mm.3dshapes/PinHeader_1x08_P2.54mm_Vertical.wrl"
    (offset (xyz 0 8.89 0))
    (scale (xyz 1 1 1))
    (rotate (xyz 0 0 0))
  )
)
