(footprint "KF_5.08_8" (version 20211014) (generator pcbnew)
  (layer "F.Cu")
  (tedit 623ED40C)
  (descr "terminal block RND 205-00238, 8 pins, pitch 5.08mm, size 40.6x8.45mm^2, drill diamater 1.1mm, pad diameter 2.1mm, see http://cdn-reichelt.de/documents/datenblatt/C151/RND_205-00232_DB_EN.pdf, script-generated using https://github.com/pointhi/kicad-footprint-generator/scripts/TerminalBlock_RND")
  (tags "THT terminal block RND 205-00238 pitch 5.08mm size 40.6x8.45mm^2 drill 1.1mm pad 2.1mm")
  (attr through_hole)
  (fp_text reference "REF**" (at -19.812 -5.588) (layer "F.SilkS")
    (effects (font (size 1 1) (thickness 0.15)))
    (tstamp 08918d67-dcf2-4651-ae72-7949683871d1)
  )
  (fp_text value "KF_5.08_8" (at 0 5.588) (layer "F.Fab")
    (effects (font (size 1 1) (thickness 0.15)))
    (tstamp 4ceaf85a-ddd5-433d-ba15-8540f494937b)
  )
  (fp_text user "${REFERENCE}" (at 0 0) (layer "F.Fab")
    (effects (font (size 1 1) (thickness 0.15)))
    (tstamp fd009f97-6a38-4f64-9659-b13eb14b4a3c)
  )
  (fp_line (start -21.844 -2.54) (end 21.844 -2.54) (layer "F.SilkS") (width 0.1778) (tstamp 834e57d0-b16f-49f8-91d1-d99b18c5f0fd))
  (fp_rect (start -19.304 -4.572) (end -16.256 -3.556) (layer "F.SilkS") (width 0.1778) (fill none) (tstamp 079d0b6e-96de-4165-b4aa-059c2244a7ad))
  (fp_rect (start -21.844 2.54) (end 21.844 3.556) (layer "F.SilkS") (width 0.1778) (fill none) (tstamp 08f410b0-d450-4db0-ab3b-7973b47a9ab4))
  (fp_rect (start 6.096 -4.572) (end 9.144 -3.556) (layer "F.SilkS") (width 0.1778) (fill none) (tstamp 1ddcf554-2054-432b-89b2-66a24f905677))
  (fp_rect (start -4.064 -4.572) (end -1.016 -3.556) (layer "F.SilkS") (width 0.1778) (fill none) (tstamp 56805c02-f7f2-4322-a790-11d864e1ad4e))
  (fp_rect (start -21.844 -4.572) (end 21.844 4.064) (layer "F.SilkS") (width 0.1778) (fill none) (tstamp 5f2966d5-a173-4d0c-a376-155ac87b528b))
  (fp_rect (start 11.176 -4.572) (end 14.224 -3.556) (layer "F.SilkS") (width 0.1778) (fill none) (tstamp 72a78a20-0e7c-4b21-93e6-4157b9d91505))
  (fp_rect (start 1.016 -4.572) (end 4.064 -3.556) (layer "F.SilkS") (width 0.1778) (fill none) (tstamp c6ec5f7a-afb7-4577-bdc4-817ad2e8c4a5))
  (fp_rect (start 16.256 -4.572) (end 19.304 -3.556) (layer "F.SilkS") (width 0.1778) (fill none) (tstamp d86e787e-9c3c-4501-a415-c128a31029ad))
  (fp_rect (start -9.144 -4.572) (end -6.096 -3.556) (layer "F.SilkS") (width 0.1778) (fill none) (tstamp eab82c13-0f5c-4572-8e8c-aa9459a6165b))
  (fp_rect (start -14.224 -4.572) (end -11.176 -3.556) (layer "F.SilkS") (width 0.1778) (fill none) (tstamp fe19aeaf-3930-46e7-b01e-f3bfaef3c3cb))
  (fp_rect (start -22.352 -5.08) (end 22.352 4.572) (layer "F.CrtYd") (width 0.0254) (fill none) (tstamp 8acc8e50-2f28-4d33-9d3a-7b621762420f))
  (fp_rect (start -21.844 -4.572) (end 21.844 4.064) (layer "F.Fab") (width 0.1) (fill none) (tstamp 2d799bea-6adc-4a7a-a03a-4950f451a716))
  (pad "1" thru_hole rect (at -17.78 0) (size 2.5 2.5) (drill 1.5) (layers *.Cu *.Mask) (tstamp f2c52d0f-b39d-45ea-b003-f46fe245d3ed))
  (pad "2" thru_hole oval (at -12.7 0) (size 2.5 2.5) (drill 1.5) (layers *.Cu *.Mask) (tstamp 2a74f003-dc6c-4fee-a55d-3ea662136cca))
  (pad "3" thru_hole oval (at -7.62 0) (size 2.5 2.5) (drill 1.5) (layers *.Cu *.Mask) (tstamp fa59e0ba-6cd1-4ce4-a74c-5fd59a89147e))
  (pad "4" thru_hole oval (at -2.54 0) (size 2.5 2.5) (drill 1.5) (layers *.Cu *.Mask) (tstamp da315196-b6a7-4f2b-8e48-0e51478b97ac))
  (pad "5" thru_hole oval (at 2.54 0) (size 2.5 2.5) (drill 1.5) (layers *.Cu *.Mask) (tstamp 53d0a1cc-50af-4bf1-9949-225c79a772ed))
  (pad "6" thru_hole oval (at 7.62 0) (size 2.5 2.5) (drill 1.5) (layers *.Cu *.Mask) (tstamp ae8de1f8-0bd0-4d46-82eb-aa04616ab2e3))
  (pad "7" thru_hole oval (at 12.7 0) (size 2.5 2.5) (drill 1.5) (layers *.Cu *.Mask) (tstamp faa57ba5-c45f-4e22-9b8e-fb139ab77fdc))
  (pad "8" thru_hole oval (at 17.78 0) (size 2.5 2.5) (drill 1.5) (layers *.Cu *.Mask) (tstamp 4b1f1fb8-96cf-4ff2-8bf0-260281c2b04a))
  (model "${KICAD6_3DMODEL_DIR}/TerminalBlock_RND.3dshapes/TerminalBlock_RND_205-00238_1x08_P5.08mm_Horizontal.wrl"
    (offset (xyz 0 0 0))
    (scale (xyz 1 1 1))
    (rotate (xyz 0 0 0))
  )
)
