(footprint "HDR_P2.54_1x12_RA" (version 20210722) (generator pcbnew) (layer "F.Cu")
  (tedit 6176BD93)
  (descr "Through hole angled pin header, 1x10, 2.54mm pitch, 6mm pin length, single row")
  (tags "Through hole angled pin header THT 1x10 2.54mm single row")
  (attr through_hole)
  (fp_text reference "REF**" (at 0 0 90) (layer "F.SilkS")
    (effects (font (size 1.016 1.016) (thickness 0.1778)))
    (tstamp d90bfe93-a520-4f7d-b9e2-7824a2af9c3a)
  )
  (fp_text value "HDR_P2.54_1x12_RA" (at 2.794 0 90) (layer "F.Fab")
    (effects (font (size 1 1) (thickness 0.15)))
    (tstamp 9d2bfccc-537e-4b8e-b874-7d8fcd4df43b)
  )
  (fp_text user "${REFERENCE}" (at 2.794 -0.066 90) (layer "F.Fab")
    (effects (font (size 1 1) (thickness 0.15)))
    (tstamp 8242277d-5bf1-4ee8-98d8-568dbc4d3c8c)
  )
  (fp_line (start 1.016 -8.636) (end 1.524 -8.636) (layer "F.SilkS") (width 0.1778) (tstamp 055db5ee-0fdc-45f5-9cca-3e368c2c9ff4))
  (fp_line (start -1.27 -13.97) (end -1.27 -15.24) (layer "F.SilkS") (width 0.1778) (tstamp 0d017bfe-4f0e-4880-813b-d130f9339f21))
  (fp_line (start 1.016 -14.224) (end 1.524 -14.224) (layer "F.SilkS") (width 0.1778) (tstamp 124cefd4-d723-4d68-b75c-9eea5c00bd0e))
  (fp_line (start 1.016 14.224) (end 1.524 14.224) (layer "F.SilkS") (width 0.1778) (tstamp 2553a046-8689-456b-b61c-e9ffd4514e29))
  (fp_line (start 1.016 3.556) (end 1.524 3.556) (layer "F.SilkS") (width 0.1778) (tstamp 25e16d71-1c7a-4dbb-95d0-0ffcc9466e90))
  (fp_line (start 1.016 6.096) (end 1.524 6.096) (layer "F.SilkS") (width 0.1778) (tstamp 3455b749-d9d9-43d5-bede-d633d23bd1a6))
  (fp_line (start 1.016 1.016) (end 1.524 1.016) (layer "F.SilkS") (width 0.1778) (tstamp 3aae3107-92f0-4c2b-a1e4-64d358ef1271))
  (fp_line (start 1.016 13.716) (end 1.524 13.716) (layer "F.SilkS") (width 0.1778) (tstamp 42e57455-c8bf-4979-9f4f-99bb585c2bbd))
  (fp_line (start 1.016 -6.604) (end 1.524 -6.604) (layer "F.SilkS") (width 0.1778) (tstamp 68c10cc3-6b3d-4238-b619-d89c1b09ee19))
  (fp_line (start 1.016 6.604) (end 1.524 6.604) (layer "F.SilkS") (width 0.1778) (tstamp 777072ba-66c4-44a5-80dc-5acbf8eed171))
  (fp_line (start 1.016 -11.176) (end 1.524 -11.176) (layer "F.SilkS") (width 0.1778) (tstamp 831e67c8-0296-46ab-83dc-00ef3039bb04))
  (fp_line (start 1.016 11.176) (end 1.524 11.176) (layer "F.SilkS") (width 0.1778) (tstamp 93a11e78-7470-413e-8995-9d8bf258631c))
  (fp_line (start 1.016 -13.716) (end 1.524 -13.716) (layer "F.SilkS") (width 0.1778) (tstamp a770e735-d419-46b6-902e-359aac66ba6a))
  (fp_line (start 1.016 -4.064) (end 1.524 -4.064) (layer "F.SilkS") (width 0.1778) (tstamp a9d3569e-16e8-479a-98eb-7efea1df9a58))
  (fp_line (start 1.016 -1.524) (end 1.524 -1.524) (layer "F.SilkS") (width 0.1778) (tstamp af1dc4f7-c00b-4876-af38-0edcd941b411))
  (fp_line (start 1.016 -9.144) (end 1.524 -9.144) (layer "F.SilkS") (width 0.1778) (tstamp b18ec5b7-dd36-4a97-92c7-c9d0f36034fb))
  (fp_line (start 1.016 1.524) (end 1.524 1.524) (layer "F.SilkS") (width 0.1778) (tstamp c521e98a-7de4-4ffd-a626-560c1d406d5d))
  (fp_line (start 1.016 9.144) (end 1.524 9.144) (layer "F.SilkS") (width 0.1778) (tstamp cb88171e-d7e7-4a4c-887c-2f8032f1b602))
  (fp_line (start 1.016 -6.096) (end 1.524 -6.096) (layer "F.SilkS") (width 0.1778) (tstamp d14afad0-a27f-44d5-af39-a2e44c540e9e))
  (fp_line (start 1.016 8.636) (end 1.524 8.636) (layer "F.SilkS") (width 0.1778) (tstamp dd8a7342-0af4-4f5d-8b7f-b60ebde7fb86))
  (fp_line (start 1.016 -1.016) (end 1.524 -1.016) (layer "F.SilkS") (width 0.1778) (tstamp e610bdff-063d-4dad-8ca2-ae62e4ddea43))
  (fp_line (start 1.016 -3.556) (end 1.524 -3.556) (layer "F.SilkS") (width 0.1778) (tstamp e848cdda-48a4-45ae-bea1-61330f68dae0))
  (fp_line (start 1.016 4.064) (end 1.524 4.064) (layer "F.SilkS") (width 0.1778) (tstamp e9163b9a-c7be-48a4-871e-b135740b07cf))
  (fp_line (start 1.016 -11.684) (end 1.524 -11.684) (layer "F.SilkS") (width 0.1778) (tstamp f512e57b-186f-40ff-923f-4f9cdbad8877))
  (fp_line (start -1.27 -15.24) (end 0 -15.24) (layer "F.SilkS") (width 0.1778) (tstamp f909690b-0ba5-425a-a1bf-64b175ecbf1e))
  (fp_line (start 1.016 11.684) (end 1.524 11.684) (layer "F.SilkS") (width 0.1778) (tstamp f9fa256f-7e9c-4f21-bb5e-1c294b08aa5e))
  (fp_rect (start 1.524 -7.62) (end 4.064 -10.16) (layer "F.SilkS") (width 0.1778) (fill none) (tstamp 10cbc184-5b48-4cce-a16b-1bb2e36b8809))
  (fp_rect (start 4.064 -1.524) (end 10.16 -1.016) (layer "F.SilkS") (width 0.1778) (fill none) (tstamp 166669ee-d2cd-4f44-bf12-476aef1fdc71))
  (fp_rect (start 4.064 -6.604) (end 10.16 -6.096) (layer "F.SilkS") (width 0.1778) (fill none) (tstamp 18fe40e8-1043-4d95-b645-df1600c3ecd0))
  (fp_rect (start 1.524 15.24) (end 4.064 12.7) (layer "F.SilkS") (width 0.1778) (fill none) (tstamp 2fad3969-a4c1-46af-b3b6-06562612074f))
  (fp_rect (start 4.064 -4.064) (end 10.16 -3.556) (layer "F.SilkS") (width 0.1778) (fill none) (tstamp 571df966-a515-41e6-b382-5644e433e36d))
  (fp_rect (start 1.524 12.7) (end 4.064 10.16) (layer "F.SilkS") (width 0.1778) (fill none) (tstamp 5af2abe8-4780-44f6-8193-1c87d5d177dd))
  (fp_rect (start 4.064 -9.144) (end 10.16 -8.636) (layer "F.SilkS") (width 0.1778) (fill none) (tstamp 5b99965d-f4d9-4194-89bd-9fa4a29a0803))
  (fp_rect (start 4.064 -11.684) (end 10.16 -11.176) (layer "F.SilkS") (width 0.1778) (fill none) (tstamp 5dbda41b-7233-4a9e-b379-e6ba755cdce6))
  (fp_rect (start 4.064 1.016) (end 10.16 1.524) (layer "F.SilkS") (width 0.1778) (fill none) (tstamp 6cef5270-884f-44d3-89ef-a2fa5217ff9b))
  (fp_rect (start 4.064 3.556) (end 10.16 4.064) (layer "F.SilkS") (width 0.1778) (fill none) (tstamp 719e4fcd-ebd8-4109-80c0-72a4cee49f1c))
  (fp_rect (start 1.524 7.62) (end 4.064 5.08) (layer "F.SilkS") (width 0.1778) (fill none) (tstamp 76318514-d94d-45ae-9b12-a71e75c983e9))
  (fp_rect (start 1.524 -5.08) (end 4.064 -7.62) (layer "F.SilkS") (width 0.1778) (fill none) (tstamp 94de9c0a-a963-4a95-9905-5ddd309fcc6b))
  (fp_rect (start 1.524 -10.16) (end 4.064 -12.7) (layer "F.SilkS") (width 0.1778) (fill none) (tstamp 9635ea3f-3eb9-40c6-a1b9-dd497e76e363))
  (fp_rect (start 1.524 -2.54) (end 4.064 -5.08) (layer "F.SilkS") (width 0.1778) (fill none) (tstamp 9661c600-f6c9-438e-85f7-f7636249c85b))
  (fp_rect (start 1.524 0) (end 4.064 -2.54) (layer "F.SilkS") (width 0.1778) (fill none) (tstamp 9ef550cf-a693-40db-bd47-86ddda3ea44d))
  (fp_rect (start 4.064 8.636) (end 10.16 9.144) (layer "F.SilkS") (width 0.1778) (fill none) (tstamp a9e1f1b9-f8e7-4e0c-8054-d498c8e3215c))
  (fp_rect (start 4.064 11.176) (end 10.16 11.684) (layer "F.SilkS") (width 0.1778) (fill none) (tstamp ab054bee-2c18-4bf1-97af-a9717d70cb0c))
  (fp_rect (start 1.524 5.08) (end 4.064 2.54) (layer "F.SilkS") (width 0.1778) (fill none) (tstamp b49632d6-1fd1-4715-a363-0a99d8af6ebb))
  (fp_rect (start 4.064 13.716) (end 10.16 14.224) (layer "F.SilkS") (width 0.1778) (fill none) (tstamp bdd467b9-6094-463a-bbd3-650478a44a54))
  (fp_rect (start 4.064 6.096) (end 10.16 6.604) (layer "F.SilkS") (width 0.1778) (fill none) (tstamp d5a925c9-7e02-425b-b575-b598fcd92d98))
  (fp_rect (start 1.524 2.54) (end 4.064 0) (layer "F.SilkS") (width 0.1778) (fill none) (tstamp da670e58-7766-4025-92eb-4b4a612514a3))
  (fp_rect (start 1.524 -12.7) (end 4.064 -15.24) (layer "F.SilkS") (width 0.1778) (fill none) (tstamp e1057b7d-5d03-4226-a125-d2267b71aaaa))
  (fp_rect (start 1.524 10.16) (end 4.064 7.62) (layer "F.SilkS") (width 0.1778) (fill none) (tstamp e6251a6b-5f3a-454a-a162-1d759ed8a5d9))
  (fp_rect (start 4.064 -14.224) (end 10.16 -13.716) (layer "F.SilkS") (width 0.1778) (fill solid) (tstamp f425d5a2-0f39-40ad-91ac-fad517911a00))
  (fp_rect (start -1.778 -15.748) (end 10.668 15.748) (layer "F.CrtYd") (width 0.0254) (fill none) (tstamp 728403df-f9f2-4424-9003-bc3653cd9799))
  (fp_line (start 4.064 15.24) (end 1.524 15.24) (layer "F.Fab") (width 0.1) (tstamp 3764f42e-e523-48a2-b9e9-d04a61352576))
  (fp_line (start 1.524 15.24) (end 1.524 -14.732) (layer "F.Fab") (width 0.1) (tstamp 3965721f-84b6-4ba2-aa90-01413c9c1b2b))
  (fp_line (start 2.032 -15.24) (end 4.064 -15.24) (layer "F.Fab") (width 0.1) (tstamp 721fa490-6c86-4ea9-a1a7-6984e986249d))
  (fp_line (start 4.064 -15.24) (end 4.064 15.24) (layer "F.Fab") (width 0.1) (tstamp 9a62cdc2-f844-4b9d-8778-a22375df4d4c))
  (fp_line (start 1.524 -14.732) (end 2.032 -15.24) (layer "F.Fab") (width 0.1) (tstamp af6573d9-19a6-4f5d-a61f-312d45cecb6c))
  (fp_rect (start -0.254 9.144) (end 1.524 8.636) (layer "F.Fab") (width 0.1) (fill none) (tstamp 05758b17-7b9d-4020-a3f3-069e7ba29d8f))
  (fp_rect (start 4.064 6.096) (end 10.16 6.604) (layer "F.Fab") (width 0.1) (fill none) (tstamp 083653b5-7886-4f3e-bdf6-19fbf6095c53))
  (fp_rect (start -0.254 -9.144) (end 1.524 -8.636) (layer "F.Fab") (width 0.1) (fill none) (tstamp 09740f0f-be40-4672-a08b-97b8b9fb16f1))
  (fp_rect (start -0.254 11.684) (end 1.524 11.176) (layer "F.Fab") (width 0.1) (fill none) (tstamp 0a0a744a-9932-4ebc-9b93-63e3642dcec3))
  (fp_rect (start 4.064 1.016) (end 10.16 1.524) (layer "F.Fab") (width 0.1) (fill none) (tstamp 1594cab5-ca83-45f1-8053-a5fe3f31bf02))
  (fp_rect (start 4.064 -9.144) (end 10.16 -8.636) (layer "F.Fab") (width 0.1) (fill none) (tstamp 2369117e-d9d4-4656-bc81-0505d578cbc8))
  (fp_rect (start 4.064 3.556) (end 10.16 4.064) (layer "F.Fab") (width 0.1) (fill none) (tstamp 3162871a-3529-41a0-9aa5-f2de5642e5d8))
  (fp_rect (start 4.064 11.176) (end 10.16 11.684) (layer "F.Fab") (width 0.1) (fill none) (tstamp 3ce72d5b-4c87-4893-81e4-25616baf6a5c))
  (fp_rect (start 4.064 -6.604) (end 10.16 -6.096) (layer "F.Fab") (width 0.1) (fill none) (tstamp 54e87720-193d-4bfb-b8ce-cf99f2584d35))
  (fp_rect (start -0.254 -4.064) (end 1.524 -3.556) (layer "F.Fab") (width 0.1) (fill none) (tstamp 6bd3a78d-a3ac-4cc5-bb41-df4e815c5e1b))
  (fp_rect (start 4.064 13.716) (end 10.16 14.224) (layer "F.Fab") (width 0.1) (fill none) (tstamp 6f124d62-3e9b-4675-a064-3f292a7feb49))
  (fp_rect (start -0.254 -11.684) (end 1.524 -11.176) (layer "F.Fab") (width 0.1) (fill none) (tstamp 7152259f-7d4d-4852-bdf6-f6de317da01f))
  (fp_rect (start -0.254 -6.604) (end 1.524 -6.096) (layer "F.Fab") (width 0.1) (fill none) (tstamp 770b62de-d662-420f-a2b0-0f7911fe7db6))
  (fp_rect (start -0.254 -1.524) (end 1.524 -1.016) (layer "F.Fab") (width 0.1) (fill none) (tstamp 88919009-b388-4d1d-86f8-e5a5dedf8b5b))
  (fp_rect (start -0.254 3.556) (end 1.524 4.064) (layer "F.Fab") (width 0.1) (fill none) (tstamp 8994ba4b-4543-4389-a1bc-3269c9f048e2))
  (fp_rect (start 4.064 -11.684) (end 10.16 -11.176) (layer "F.Fab") (width 0.1) (fill none) (tstamp 8af34b74-29eb-4b6b-b8cd-dcad5a4d17d1))
  (fp_rect (start 4.064 -4.064) (end 10.16 -3.556) (layer "F.Fab") (width 0.1) (fill none) (tstamp 8e098577-089f-4c28-bdd0-da5e702637d5))
  (fp_rect (start -0.254 -14.224) (end 1.524 -13.716) (layer "F.Fab") (width 0.1) (fill none) (tstamp 8f3b9e3f-1dfd-4f5b-9a32-e67cfa6ab8d8))
  (fp_rect (start -0.254 1.524) (end 1.524 1.016) (layer "F.Fab") (width 0.1) (fill none) (tstamp 97bd937c-4597-45a9-8153-03ffedfc745c))
  (fp_rect (start 4.064 8.636) (end 10.16 9.144) (layer "F.Fab") (width 0.1) (fill none) (tstamp 9bf4d9f4-8d14-47c1-97db-f6a659b482b0))
  (fp_rect (start 4.064 -14.224) (end 10.16 -13.716) (layer "F.Fab") (width 0.1) (fill none) (tstamp aa6407a5-98f8-4c5c-9156-c993e70d1ef2))
  (fp_rect (start -0.254 6.604) (end 1.524 6.096) (layer "F.Fab") (width 0.1) (fill none) (tstamp ad5aca98-3c9d-4817-974e-49333a8d3271))
  (fp_rect (start 4.064 -1.524) (end 10.16 -1.016) (layer "F.Fab") (width 0.1) (fill none) (tstamp ea88ddb4-2091-4dd2-b70b-7a8351736e86))
  (fp_rect (start -0.254 13.716) (end 1.524 14.224) (layer "F.Fab") (width 0.1) (fill none) (tstamp faeef366-7e7d-43f0-aa66-32e162f7a604))
  (pad "1" thru_hole roundrect locked (at 0 -13.97) (size 2.032 1.778) (drill 1.016) (layers *.Cu *.Mask) (roundrect_rratio 0.1) (tstamp abecff5a-756e-4f78-8a27-c0608ce73de1))
  (pad "2" thru_hole oval locked (at 0 -11.43) (size 2.032 1.778) (drill 1.016) (layers *.Cu *.Mask) (tstamp d4cf0943-8dc6-4309-a85f-7c26f0e7045d))
  (pad "3" thru_hole oval locked (at 0 -8.89) (size 2.032 1.778) (drill 1.016) (layers *.Cu *.Mask) (tstamp 34decd78-8859-4903-99c9-53655bbf4ab5))
  (pad "4" thru_hole oval (at 0 -6.35) (size 2.032 1.778) (drill 1.016) (layers *.Cu *.Mask) (tstamp b83ca436-623d-4031-a8d0-adc3346d8114))
  (pad "5" thru_hole oval (at 0 -3.81) (size 2.032 1.778) (drill 1.016) (layers *.Cu *.Mask) (tstamp 88070872-12ce-46e4-b8fd-dd7501d5df23))
  (pad "6" thru_hole oval (at 0 -1.27) (size 2.032 1.778) (drill 1.016) (layers *.Cu *.Mask) (tstamp d16dbf2c-58eb-4fe3-99b8-d040b65f98bb))
  (pad "7" thru_hole oval (at 0 1.27) (size 2.032 1.778) (drill 1.016) (layers *.Cu *.Mask) (tstamp 73fb774b-0f1b-4978-ae9c-1db986e0733f))
  (pad "8" thru_hole oval (at 0 3.81) (size 2.032 1.778) (drill 1.016) (layers *.Cu *.Mask) (tstamp bfa8a558-eb8d-4f74-b29a-94b636683699))
  (pad "9" thru_hole oval (at 0 6.35) (size 2.032 1.778) (drill 1.016) (layers *.Cu *.Mask) (tstamp 5adb336b-3f86-4e84-9968-26e61587ae9e))
  (pad "10" thru_hole oval (at 0 8.89) (size 2.032 1.778) (drill 1.016) (layers *.Cu *.Mask) (tstamp 108db68b-8baa-4855-aad3-d2165e25aede))
  (pad "11" thru_hole oval (at 0 11.43) (size 2.032 1.778) (drill 1.016) (layers *.Cu *.Mask) (tstamp db79e01d-02ed-4f4b-ac95-928155a7687e))
  (pad "12" thru_hole oval (at 0 13.97) (size 2.032 1.778) (drill 1.016) (layers *.Cu *.Mask) (tstamp 78647cb0-09db-46c0-a640-b22c0defa92e))
  (model "${KICAD6_3DMODEL_DIR}/Connector_PinHeader_2.54mm.3dshapes/PinHeader_1x12_P2.54mm_Horizontal.wrl"
    (offset (xyz 0 13.97 0))
    (scale (xyz 1 1 1))
    (rotate (xyz 0 0 0))
  )
)
