(footprint "Touch_fido" (version 20211014) (generator pcbnew) (layer "F.Cu")
  (tedit 6179512C)
  (descr "Capacitor SMD 1206 (3216 Metric), square (rectangular) end terminal, IPC_7351 nominal, (Body size source: IPC-SM-782 page 76, https://www.pcb-3d.com/wordpress/wp-content/uploads/ipc-sm-782a_amendment_1_and_2.pdf), generated with kicad-footprint-generator")
  (tags "capacitor")
  (attr smd)
  (fp_text reference "REF**" (at 0 0) (layer "F.SilkS")
    (effects (font (size 1.016 1.016) (thickness 0.1778)))
    (tstamp c919aef1-7173-474f-9a09-fae57350bef3)
  )
  (fp_text value "Touch_fido" (at 0 0) (layer "F.Fab")
    (effects (font (size 0.508 0.508) (thickness 0.127)))
    (tstamp d43355f6-6b77-4c5f-99d6-bbb42e90bd50)
  )
  (fp_text user "${REFERENCE}" (at 0 0) (layer "F.Fab")
    (effects (font (size 0.508 0.508) (thickness 0.127)))
    (tstamp 3230cfe3-c287-4e0e-8b82-7e7745297457)
  )
  (fp_rect (start -4.064 -0.635) (end 4.064 0.635) (layer "F.CrtYd") (width 0.0254) (fill none) (tstamp 478d81cc-6668-4230-a7c8-4238281b8d89))
  (pad "1" thru_hole oval (at 0 0) (size 8 1) (drill oval 7.5 0.5) (layers *.Cu *.Mask) (tstamp 84cf02e2-0d0c-4677-a222-62dae3df9871))
)
