(footprint "Cap_Radial_D8.0_P5.0" (version 20210228) (generator pcbnew) (layer "F.Cu")
  (tedit 606ECA49)
  (descr "CP, Radial series, Radial, pin pitch=5.00mm, , diameter=8mm, Electrolytic Capacitor")
  (tags "CP Radial series Radial pin pitch 5.00mm  diameter 8mm Electrolytic Capacitor")
  (fp_text reference "REF**" (at 2.5 -5.25) (layer "F.SilkS")
    (effects (font (size 1 1) (thickness 0.15)))
    (tstamp 94dc0c26-a7b5-445d-9983-3715debef3fa)
  )
  (fp_text value "Cap_Radial_D8.0_P5.0" (at 2.5 5.25) (layer "F.Fab")
    (effects (font (size 1 1) (thickness 0.15)))
    (tstamp ca5bf693-0d97-4b09-a797-f791d9e6302b)
  )
  (fp_text user "${REFERENCE}" (at 2.5 0) (layer "F.Fab")
    (effects (font (size 1 1) (thickness 0.15)))
    (tstamp 54184e9e-71d8-401b-9d46-261882948569)
  )
  (fp_line (start 5.981 1.04) (end 5.981 2.166) (layer "F.SilkS") (width 0.12) (tstamp 006f1250-f3bc-4aec-87f7-9c1bfdab2315))
  (fp_line (start 5.181 1.04) (end 5.181 3.09) (layer "F.SilkS") (width 0.12) (tstamp 026ecf1e-554c-4651-8af7-3569b3a61ef5))
  (fp_line (start 4.261 -3.686) (end 4.261 -1.04) (layer "F.SilkS") (width 0.12) (tstamp 02e80ab7-ac7e-419e-9135-c23d4ebc6db1))
  (fp_line (start 4.061 -3.774) (end 4.061 -1.04) (layer "F.SilkS") (width 0.12) (tstamp 0311fee7-2318-4b49-b6da-119cd6da2749))
  (fp_line (start 4.381 -3.627) (end 4.381 -1.04) (layer "F.SilkS") (width 0.12) (tstamp 05b822fb-af74-4613-a560-c22dd6f09e59))
  (fp_line (start 2.66 -4.077) (end 2.66 4.077) (layer "F.SilkS") (width 0.12) (tstamp 0bc04fc3-ec81-4173-8666-5225cdb12203))
  (fp_line (start 5.941 -2.228) (end 5.941 -1.04) (layer "F.SilkS") (width 0.12) (tstamp 0e6cfed3-6fe9-44df-8ad5-436e67cc1a80))
  (fp_line (start 5.141 -3.124) (end 5.141 -1.04) (layer "F.SilkS") (width 0.12) (tstamp 1174fe44-43a6-4a39-ac93-ff3ac9939165))
  (fp_line (start 5.741 1.04) (end 5.741 2.505) (layer "F.SilkS") (width 0.12) (tstamp 12619580-91f1-43ff-8476-b73ce8940f81))
  (fp_line (start 3.581 -3.936) (end 3.581 3.936) (layer "F.SilkS") (width 0.12) (tstamp 14faf057-b8e4-46cc-987b-ba4315c739ef))
  (fp_line (start 3.661 -3.914) (end 3.661 3.914) (layer "F.SilkS") (width 0.12) (tstamp 2078eba0-5ff9-485c-9d6d-22c69315c6d6))
  (fp_line (start 5.861 -2.345) (end 5.861 -1.04) (layer "F.SilkS") (width 0.12) (tstamp 22b463ff-4996-4708-91af-cd031c9bb07e))
  (fp_line (start 5.981 -2.166) (end 5.981 -1.04) (layer "F.SilkS") (width 0.12) (tstamp 23eeac57-cdba-40f0-b41b-ddd621bd68ae))
  (fp_line (start 5.301 1.04) (end 5.301 2.983) (layer "F.SilkS") (width 0.12) (tstamp 25820530-a8e6-4551-b5ce-de30614d6094))
  (fp_line (start 3.941 -3.821) (end 3.941 3.821) (layer "F.SilkS") (width 0.12) (tstamp 25b80cf9-a111-4b8f-b365-7ae664263e5b))
  (fp_line (start 5.461 1.04) (end 5.461 2.826) (layer "F.SilkS") (width 0.12) (tstamp 25d04ddf-002d-498f-8a7b-9990f9c3df61))
  (fp_line (start 5.021 1.04) (end 5.021 3.22) (layer "F.SilkS") (width 0.12) (tstamp 27334877-926f-47ba-a974-cca897f71725))
  (fp_line (start 5.821 1.04) (end 5.821 2.4) (layer "F.SilkS") (width 0.12) (tstamp 27d37c7a-9c86-4332-8925-36fbcc5cfce4))
  (fp_line (start 4.581 -3.517) (end 4.581 -1.04) (layer "F.SilkS") (width 0.12) (tstamp 2ab00d7e-ab67-40bf-b45c-905a51756821))
  (fp_line (start 6.101 -1.964) (end 6.101 1.964) (layer "F.SilkS") (width 0.12) (tstamp 2c667040-537b-41c5-ac97-aed8b117a431))
  (fp_line (start 5.941 1.04) (end 5.941 2.228) (layer "F.SilkS") (width 0.12) (tstamp 2f97e4e7-aff5-48f9-bc5c-7dba26f94dad))
  (fp_line (start 5.501 -2.784) (end 5.501 -1.04) (layer "F.SilkS") (width 0.12) (tstamp 2fe41c00-0b8f-477d-87f2-06bd673e6bf7))
  (fp_line (start 6.261 -1.645) (end 6.261 1.645) (layer "F.SilkS") (width 0.12) (tstamp 307c97dc-349b-43e6-b438-df1437edb8dc))
  (fp_line (start 5.381 1.04) (end 5.381 2.907) (layer "F.SilkS") (width 0.12) (tstamp 308824e8-430a-4034-b7ba-62c9cb2d89a4))
  (fp_line (start 3.06 -4.042) (end 3.06 4.042) (layer "F.SilkS") (width 0.12) (tstamp 320f1d1d-81e9-4c01-a242-fcbfd7d9a795))
  (fp_line (start 6.221 -1.731) (end 6.221 1.731) (layer "F.SilkS") (width 0.12) (tstamp 3321f56d-9efe-4436-808e-5cc7b92185ca))
  (fp_line (start 3.18 -4.024) (end 3.18 4.024) (layer "F.SilkS") (width 0.12) (tstamp 332f4b8e-5e2e-4ab1-86f8-ba6174264105))
  (fp_line (start 3.541 -3.947) (end 3.541 3.947) (layer "F.SilkS") (width 0.12) (tstamp 3635cc54-2970-422b-9535-bd813595e6dd))
  (fp_line (start 5.101 -3.156) (end 5.101 -1.04) (layer "F.SilkS") (width 0.12) (tstamp 37a04838-eb23-4866-ba46-d83fe28c57f0))
  (fp_line (start 4.541 -3.54) (end 4.541 -1.04) (layer "F.SilkS") (width 0.12) (tstamp 38087344-abe3-4718-b415-1b8389f7ced9))
  (fp_line (start 6.381 -1.346) (end 6.381 1.346) (layer "F.SilkS") (width 0.12) (tstamp 38cc9f30-5cb3-40e9-b3ae-1de791515b5b))
  (fp_line (start 4.781 -3.392) (end 4.781 -1.04) (layer "F.SilkS") (width 0.12) (tstamp 3c6eb04e-70a0-475a-911a-0661eecf4f7a))
  (fp_line (start 6.341 -1.453) (end 6.341 1.453) (layer "F.SilkS") (width 0.12) (tstamp 3d24d571-9063-49d0-99c9-a4f81ecaa350))
  (fp_line (start 3.501 -3.957) (end 3.501 3.957) (layer "F.SilkS") (width 0.12) (tstamp 3d367e0b-7998-4c85-bcea-7f1c533b18e7))
  (fp_line (start 5.261 -3.019) (end 5.261 -1.04) (layer "F.SilkS") (width 0.12) (tstamp 3d57bbb0-e0ff-4802-85ed-7151f820ee5b))
  (fp_line (start 2.86 -4.065) (end 2.86 4.065) (layer "F.SilkS") (width 0.12) (tstamp 3ee67246-4bd8-4cce-8214-e7bd0b423abc))
  (fp_line (start 4.341 1.04) (end 4.341 3.647) (layer "F.SilkS") (width 0.12) (tstamp 40741938-a554-4356-9bd0-4394dc645d4d))
  (fp_line (start 4.501 -3.562) (end 4.501 -1.04) (layer "F.SilkS") (width 0.12) (tstamp 41429263-9d3b-4cbb-a98c-898a9b6d8b81))
  (fp_line (start 4.741 -3.418) (end 4.741 -1.04) (layer "F.SilkS") (width 0.12) (tstamp 41aa0302-5dfa-46e9-84b0-f6bae4dc87bb))
  (fp_line (start 2.62 -4.079) (end 2.62 4.079) (layer "F.SilkS") (width 0.12) (tstamp 43980c55-9a64-4de7-a855-9cb079f39f07))
  (fp_line (start 4.861 1.04) (end 4.861 3.338) (layer "F.SilkS") (width 0.12) (tstamp 4433c057-c8b3-4e94-8eb1-4862f488a43c))
  (fp_line (start 5.221 1.04) (end 5.221 3.055) (layer "F.SilkS") (width 0.12) (tstamp 4484dbb2-f290-4aa8-864a-92a8ee71f192))
  (fp_line (start 4.941 1.04) (end 4.941 3.28) (layer "F.SilkS") (width 0.12) (tstamp 457f467f-7460-4c44-b014-c7cd9bc26974))
  (fp_line (start 5.021 -3.22) (end 5.021 -1.04) (layer "F.SilkS") (width 0.12) (tstamp 457f8d1d-af74-418a-81d5-4e48dea97dc3))
  (fp_line (start 5.501 1.04) (end 5.501 2.784) (layer "F.SilkS") (width 0.12) (tstamp 4ac06f23-8c9a-4b2b-83cf-34f449bfd5ce))
  (fp_line (start 6.541 -0.768) (end 6.541 0.768) (layer "F.SilkS") (width 0.12) (tstamp 4db5948e-7058-4639-a2f2-51a5ee3b8bd1))
  (fp_line (start 4.021 -3.79) (end 4.021 -1.04) (layer "F.SilkS") (width 0.12) (tstamp 4e7687d4-6f03-4a03-b6c4-ec76f9fa97ce))
  (fp_line (start 5.461 -2.826) (end 5.461 -1.04) (layer "F.SilkS") (width 0.12) (tstamp 51301dc9-89a8-4966-a79c-4f312985f3d9))
  (fp_line (start 5.861 1.04) (end 5.861 2.345) (layer "F.SilkS") (width 0.12) (tstamp 54658102-f6b0-4602-9a6e-32f1aff8fa06))
  (fp_line (start 4.701 1.04) (end 4.701 3.444) (layer "F.SilkS") (width 0.12) (tstamp 54b0aafc-7389-4091-b7cc-73d1214953a9))
  (fp_line (start 2.7 -4.076) (end 2.7 4.076) (layer "F.SilkS") (width 0.12) (tstamp 556b1cdb-e6b6-40d9-956a-9fe1932d5314))
  (fp_line (start 5.621 1.04) (end 5.621 2.651) (layer "F.SilkS") (width 0.12) (tstamp 56bc0cbf-371d-4fee-b498-61783298ad45))
  (fp_line (start 2.74 -4.074) (end 2.74 4.074) (layer "F.SilkS") (width 0.12) (tstamp 56d316b5-9625-4839-90f8-87b0eada26ff))
  (fp_line (start 6.301 -1.552) (end 6.301 1.552) (layer "F.SilkS") (width 0.12) (tstamp 580f17d8-209f-458d-a034-352e9b3a5420))
  (fp_line (start 2.58 -4.08) (end 2.58 4.08) (layer "F.SilkS") (width 0.12) (tstamp 58a4876e-ba66-438a-aff5-f06d2ab19621))
  (fp_line (start 5.541 1.04) (end 5.541 2.741) (layer "F.SilkS") (width 0.12) (tstamp 58ba4db1-132b-4552-b0bc-96aa4cd4f01a))
  (fp_line (start 4.141 -3.74) (end 4.141 -1.04) (layer "F.SilkS") (width 0.12) (tstamp 59da9cfb-c4fb-4fa0-ae2d-1d64708cbb75))
  (fp_line (start 6.021 -2.102) (end 6.021 -1.04) (layer "F.SilkS") (width 0.12) (tstamp 59ec46aa-9d73-442b-9e05-9383a9b7e16e))
  (fp_line (start 5.701 -2.556) (end 5.701 -1.04) (layer "F.SilkS") (width 0.12) (tstamp 5a3612fc-6462-404d-aaee-2485db7f4e8e))
  (fp_line (start 5.341 1.04) (end 5.341 2.945) (layer "F.SilkS") (width 0.12) (tstamp 5ac0fc9e-7d7f-43f9-aa89-78d280a0e33c))
  (fp_line (start 4.701 -3.444) (end 4.701 -1.04) (layer "F.SilkS") (width 0.12) (tstamp 5f8987e9-1666-4d89-83f0-0b2bb4487318))
  (fp_line (start 5.181 -3.09) (end 5.181 -1.04) (layer "F.SilkS") (width 0.12) (tstamp 60114496-d18a-4cc3-81c1-8ce9f96e7f83))
  (fp_line (start 4.661 1.04) (end 4.661 3.469) (layer "F.SilkS") (width 0.12) (tstamp 613a1aa5-7ee5-4191-b27a-9a24e4eae03c))
  (fp_line (start 3.02 -4.048) (end 3.02 4.048) (layer "F.SilkS") (width 0.12) (tstamp 61cc2dfc-64a7-4ee7-b896-6803c1aaf073))
  (fp_line (start 4.341 -3.647) (end 4.341 -1.04) (layer "F.SilkS") (width 0.12) (tstamp 6455a39c-8380-4f1f-bdc9-ccdfd0c9c475))
  (fp_line (start 4.981 -3.25) (end 4.981 -1.04) (layer "F.SilkS") (width 0.12) (tstamp 6582ce20-571d-4e27-8fb5-27aaa029e855))
  (fp_line (start 6.061 -2.034) (end 6.061 2.034) (layer "F.SilkS") (width 0.12) (tstamp 6e2bfa9d-3730-444f-b7ea-f4c4eeb586c2))
  (fp_line (start 4.181 1.04) (end 4.181 3.722) (layer "F.SilkS") (width 0.12) (tstamp 6ed3a132-6ef5-4b9b-8a13-499adc07ff91))
  (fp_line (start 5.581 -2.697) (end 5.581 -1.04) (layer "F.SilkS") (width 0.12) (tstamp 70461549-e85f-48b4-a839-50e7d51e67f6))
  (fp_line (start 3.741 -3.889) (end 3.741 3.889) (layer "F.SilkS") (width 0.12) (tstamp 70da1a20-d522-4fe7-ad22-b9b63b5664f7))
  (fp_line (start 5.781 -2.454) (end 5.781 -1.04) (layer "F.SilkS") (width 0.12) (tstamp 72fb5864-73df-48f4-9c21-10e633dd8b63))
  (fp_line (start 2.98 -4.052) (end 2.98 4.052) (layer "F.SilkS") (width 0.12) (tstamp 732b70f2-80da-49a8-accd-3d2fa2d3a70f))
  (fp_line (start 4.901 1.04) (end 4.901 3.309) (layer "F.SilkS") (width 0.12) (tstamp 73b653f5-910a-4bf2-b13f-a344f4711131))
  (fp_line (start 3.14 -4.03) (end 3.14 4.03) (layer "F.SilkS") (width 0.12) (tstamp 73d63aae-b1c5-4eca-9180-e063831bed21))
  (fp_line (start 4.141 1.04) (end 4.141 3.74) (layer "F.SilkS") (width 0.12) (tstamp 7578e844-9171-4fdb-b8f2-98023939f59b))
  (fp_line (start 3.621 -3.925) (end 3.621 3.925) (layer "F.SilkS") (width 0.12) (tstamp 7c555f3c-7adc-4c78-82ad-0b4b8c888e74))
  (fp_line (start 5.141 1.04) (end 5.141 3.124) (layer "F.SilkS") (width 0.12) (tstamp 7d878bbc-669a-4c72-ad53-7e7de76fe518))
  (fp_line (start 3.301 -4.002) (end 3.301 4.002) (layer "F.SilkS") (width 0.12) (tstamp 8030d8e4-35c9-4167-af22-4757b2eccbd7))
  (fp_line (start 4.821 -3.365) (end 4.821 -1.04) (layer "F.SilkS") (width 0.12) (tstamp 819f4808-2e45-4014-ac82-3952774504bb))
  (fp_line (start 6.581 -0.533) (end 6.581 0.533) (layer "F.SilkS") (width 0.12) (tstamp 8358c33f-90f3-4392-9a38-43e13c0e029f))
  (fp_line (start 3.421 -3.976) (end 3.421 3.976) (layer "F.SilkS") (width 0.12) (tstamp 86087397-c254-4466-9057-d0f11c8dde45))
  (fp_line (start 3.901 -3.835) (end 3.901 3.835) (layer "F.SilkS") (width 0.12) (tstamp 86e1799a-4d9d-4f6a-83da-c0a625088447))
  (fp_line (start 2.5 -4.08) (end 2.5 4.08) (layer "F.SilkS") (width 0.12) (tstamp 87e83901-d152-496d-aa9e-03c0606eb877))
  (fp_line (start 5.741 -2.505) (end 5.741 -1.04) (layer "F.SilkS") (width 0.12) (tstamp 8838d471-16ba-4ea7-9b6e-2ff9fe54d247))
  (fp_line (start 4.741 1.04) (end 4.741 3.418) (layer "F.SilkS") (width 0.12) (tstamp 8a6a7a55-08e6-4f5d-82de-78f6de842427))
  (fp_line (start 3.461 -3.967) (end 3.461 3.967) (layer "F.SilkS") (width 0.12) (tstamp 8abdfef7-544b-429f-abb8-b2f4fb9ed63c))
  (fp_line (start -1.909698 -2.315) (end -1.109698 -2.315) (layer "F.SilkS") (width 0.12) (tstamp 8b17d32f-f44b-4ea8-9c48-6944da9d41f3))
  (fp_line (start 4.101 -3.757) (end 4.101 -1.04) (layer "F.SilkS") (width 0.12) (tstamp 8b637aa9-1782-45a2-96ad-f9c620305a33))
  (fp_line (start 5.101 1.04) (end 5.101 3.156) (layer "F.SilkS") (width 0.12) (tstamp 8da4494a-f645-47f8-82ed-4d6d8c1d44a5))
  (fp_line (start 5.901 -2.287) (end 5.901 -1.04) (layer "F.SilkS") (width 0.12) (tstamp 8e442ac5-a5c3-4ec0-9dd6-e973efe08fcb))
  (fp_line (start 5.781 1.04) (end 5.781 2.454) (layer "F.SilkS") (width 0.12) (tstamp 8ee1c27b-f113-4104-9eab-ee50a8dcf928))
  (fp_line (start 4.461 -3.584) (end 4.461 -1.04) (layer "F.SilkS") (width 0.12) (tstamp 93b5aa6b-3453-4e48-93f2-955130c4c941))
  (fp_line (start 4.301 -3.666) (end 4.301 -1.04) (layer "F.SilkS") (width 0.12) (tstamp 9402a256-e90a-4c4d-a3b2-90ddc3679289))
  (fp_line (start 4.021 1.04) (end 4.021 3.79) (layer "F.SilkS") (width 0.12) (tstamp 961e5f76-8832-4ebb-b68f-22139ecaacd6))
  (fp_line (start 3.1 -4.037) (end 3.1 4.037) (layer "F.SilkS") (width 0.12) (tstamp 96c3b632-b387-4583-bdb0-25e56e8e2319))
  (fp_line (start 6.021 1.04) (end 6.021 2.102) (layer "F.SilkS") (width 0.12) (tstamp 97e7f84c-43fc-412d-883f-afac50670c7a))
  (fp_line (start 2.94 -4.057) (end 2.94 4.057) (layer "F.SilkS") (width 0.12) (tstamp 98f07bd7-a43f-48fc-8d51-2355e89071bc))
  (fp_line (start 5.541 -2.741) (end 5.541 -1.04) (layer "F.SilkS") (width 0.12) (tstamp 9fe55761-4ac5-4b73-853f-6abb4f592c8e))
  (fp_line (start 3.981 -3.805) (end 3.981 -1.04) (layer "F.SilkS") (width 0.12) (tstamp a0315474-ca61-4d12-a08a-9dba1ef385c4))
  (fp_line (start 4.261 1.04) (end 4.261 3.686) (layer "F.SilkS") (width 0.12) (tstamp a14948ae-32f7-4923-8981-0556b0f71bf4))
  (fp_line (start 5.261 1.04) (end 5.261 3.019) (layer "F.SilkS") (width 0.12) (tstamp a19f9a3e-e1f5-4e3d-a460-f5e709c7d253))
  (fp_line (start 5.701 1.04) (end 5.701 2.556) (layer "F.SilkS") (width 0.12) (tstamp a3932771-4c56-400e-a6a4-772e0db6c4e1))
  (fp_line (start 3.261 -4.01) (end 3.261 4.01) (layer "F.SilkS") (width 0.12) (tstamp a3deceef-db27-4f93-8bbd-ab8a294175c4))
  (fp_line (start 4.781 1.04) (end 4.781 3.392) (layer "F.SilkS") (width 0.12) (tstamp a5e2c362-eccc-4ca1-a97a-7692d4c42777))
  (fp_line (start 4.821 1.04) (end 4.821 3.365) (layer "F.SilkS") (width 0.12) (tstamp a8d60ac6-5755-4d53-8685-51dd983a4548))
  (fp_line (start 5.661 -2.604) (end 5.661 -1.04) (layer "F.SilkS") (width 0.12) (tstamp a8d83903-5159-4197-8c1f-adcf30ee9141))
  (fp_line (start 2.82 -4.068) (end 2.82 4.068) (layer "F.SilkS") (width 0.12) (tstamp a9bf863a-10b7-4367-9d50-f91fbfff098a))
  (fp_line (start 5.221 -3.055) (end 5.221 -1.04) (layer "F.SilkS") (width 0.12) (tstamp aa020000-a809-4b86-82e7-c9ebe231194a))
  (fp_line (start 4.581 1.04) (end 4.581 3.517) (layer "F.SilkS") (width 0.12) (tstamp aab79950-95cc-42ef-b0ad-a5368d62427b))
  (fp_line (start 3.981 1.04) (end 3.981 3.805) (layer "F.SilkS") (width 0.12) (tstamp ab069080-6c01-46f9-8a7a-1600d6ad4e46))
  (fp_line (start 5.901 1.04) (end 5.901 2.287) (layer "F.SilkS") (width 0.12) (tstamp ab255a2b-ef27-4ec2-bc88-6d4dbcaf0aab))
  (fp_line (start 4.221 1.04) (end 4.221 3.704) (layer "F.SilkS") (width 0.12) (tstamp ad4e3a84-9853-4a6e-87c8-4d926f0db80f))
  (fp_line (start 4.901 -3.309) (end 4.901 -1.04) (layer "F.SilkS") (width 0.12) (tstamp b0aad130-7aa3-416b-9819-9e0b882bb2c0))
  (fp_line (start 5.341 -2.945) (end 5.341 -1.04) (layer "F.SilkS") (width 0.12) (tstamp b245d946-9094-4292-aa3f-055aa96cdf3d))
  (fp_line (start -1.509698 -2.715) (end -1.509698 -1.915) (layer "F.SilkS") (width 0.12) (tstamp b4d53ee9-579b-418e-8690-a74a78ee8b7e))
  (fp_line (start 3.381 -3.985) (end 3.381 3.985) (layer "F.SilkS") (width 0.12) (tstamp b665925b-b8aa-4ef1-8078-f9c042db901b))
  (fp_line (start 4.501 1.04) (end 4.501 3.562) (layer "F.SilkS") (width 0.12) (tstamp b7dcf16f-c11d-45c3-9f9c-e10219f5696d))
  (fp_line (start 4.421 1.04) (end 4.421 3.606) (layer "F.SilkS") (width 0.12) (tstamp b811aaa0-61ab-493a-8b15-65ad8c23e9d2))
  (fp_line (start 4.421 -3.606) (end 4.421 -1.04) (layer "F.SilkS") (width 0.12) (tstamp b92ed12a-6157-4cfb-a263-d45d7315519b))
  (fp_line (start 6.141 -1.89) (end 6.141 1.89) (layer "F.SilkS") (width 0.12) (tstamp bc3ffd83-6534-4001-8908-a4350f18507a))
  (fp_line (start 5.581 1.04) (end 5.581 2.697) (layer "F.SilkS") (width 0.12) (tstamp be0d9bc7-e78c-42fb-9d38-b9c5f4c3e67e))
  (fp_line (start 4.061 1.04) (end 4.061 3.774) (layer "F.SilkS") (width 0.12) (tstamp c11c11af-57bd-4af5-9826-c4f469514806))
  (fp_line (start 4.621 1.04) (end 4.621 3.493) (layer "F.SilkS") (width 0.12) (tstamp c557e651-5f28-459c-8e04-b803d02af1e9))
  (fp_line (start 6.501 -0.948) (end 6.501 0.948) (layer "F.SilkS") (width 0.12) (tstamp c775ea90-47bf-42b7-a3c8-afc590d6f34d))
  (fp_line (start 4.221 -3.704) (end 4.221 -1.04) (layer "F.SilkS") (width 0.12) (tstamp ca458240-fa33-44fa-b075-13ca4f4e75fe))
  (fp_line (start 5.061 -3.189) (end 5.061 -1.04) (layer "F.SilkS") (width 0.12) (tstamp cbe17c8d-16ff-4b3f-8da9-775c46bfa8a0))
  (fp_line (start 5.661 1.04) (end 5.661 2.604) (layer "F.SilkS") (width 0.12) (tstamp cd8b1601-410d-42ed-8da5-34b448051457))
  (fp_line (start 3.861 -3.85) (end 3.861 3.85) (layer "F.SilkS") (width 0.12) (tstamp ce9b6e04-d0c7-4202-9818-fa60c5ac6767))
  (fp_line (start 4.861 -3.338) (end 4.861 -1.04) (layer "F.SilkS") (width 0.12) (tstamp cf29e686-d5f9-4d41-928e-8e5b961ab881))
  (fp_line (start 2.78 -4.071) (end 2.78 4.071) (layer "F.SilkS") (width 0.12) (tstamp cfcd1089-ec38-46e2-9c78-5e83fffa7dfc))
  (fp_line (start 4.621 -3.493) (end 4.621 -1.04) (layer "F.SilkS") (width 0.12) (tstamp d04dcfa5-00f0-47b1-93d9-8d50c98a39b4))
  (fp_line (start 6.181 -1.813) (end 6.181 1.813) (layer "F.SilkS") (width 0.12) (tstamp d244bcf0-fa29-4b07-bc68-a87fdd641135))
  (fp_line (start 6.461 -1.098) (end 6.461 1.098) (layer "F.SilkS") (width 0.12) (tstamp d6f555df-e842-4d95-8e6f-8f0dfa7e295d))
  (fp_line (start 5.821 -2.4) (end 5.821 -1.04) (layer "F.SilkS") (width 0.12) (tstamp d7583196-faa0-4bf4-95e9-3d291da8d3df))
  (fp_line (start 4.101 1.04) (end 4.101 3.757) (layer "F.SilkS") (width 0.12) (tstamp d8252816-c056-4058-b083-28a08d13cd44))
  (fp_line (start 3.701 -3.902) (end 3.701 3.902) (layer "F.SilkS") (width 0.12) (tstamp d8783f54-3153-40e7-b8eb-f082714332ed))
  (fp_line (start 4.181 -3.722) (end 4.181 -1.04) (layer "F.SilkS") (width 0.12) (tstamp d9e08776-61ee-4a4e-bcd3-6d3ae29e1032))
  (fp_line (start 5.301 -2.983) (end 5.301 -1.04) (layer "F.SilkS") (width 0.12) (tstamp dabe3b0c-b8cc-43a4-8191-cca54e310057))
  (fp_line (start 3.821 -3.863) (end 3.821 3.863) (layer "F.SilkS") (width 0.12) (tstamp dbf087d1-919e-49cf-aaa0-dcd666d52bd7))
  (fp_line (start 4.381 1.04) (end 4.381 3.627) (layer "F.SilkS") (width 0.12) (tstamp de2bbd5a-5b87-48ed-aaff-65f79cb6b2f0))
  (fp_line (start 4.541 1.04) (end 4.541 3.54) (layer "F.SilkS") (width 0.12) (tstamp def5ebf9-aefb-4b02-82c9-fd9f0bc41a11))
  (fp_line (start 3.781 -3.877) (end 3.781 3.877) (layer "F.SilkS") (width 0.12) (tstamp e5c05619-b916-4900-af50-971d29004402))
  (fp_line (start 2.9 -4.061) (end 2.9 4.061) (layer "F.SilkS") (width 0.12) (tstamp e971733f-ffc5-4b89-8916-a420424417c3))
  (fp_line (start 3.341 -3.994) (end 3.341 3.994) (layer "F.SilkS") (width 0.12) (tstamp ea03e285-4697-4529-a590-55be5eac7843))
  (fp_line (start 5.621 -2.651) (end 5.621 -1.04) (layer "F.SilkS") (width 0.12) (tstamp ecd177e3-1c9f-45a4-8377-642f346260ee))
  (fp_line (start 4.661 -3.469) (end 4.661 -1.04) (layer "F.SilkS") (width 0.12) (tstamp ecf6215c-1c47-4616-846d-a19ded60ea23))
  (fp_line (start 4.981 1.04) (end 4.981 3.25) (layer "F.SilkS") (width 0.12) (tstamp ee094b67-86a3-4406-99fc-57a4c5d07dfe))
  (fp_line (start 5.381 -2.907) (end 5.381 -1.04) (layer "F.SilkS") (width 0.12) (tstamp f0825168-5247-4b35-9e09-7ef84d32a737))
  (fp_line (start 2.54 -4.08) (end 2.54 4.08) (layer "F.SilkS") (width 0.12) (tstamp f1d763b4-f32c-4ef5-ad57-44d2e525a922))
  (fp_line (start 4.461 1.04) (end 4.461 3.584) (layer "F.SilkS") (width 0.12) (tstamp f5cc372e-5951-4e19-a34e-ab317ae6b41b))
  (fp_line (start 3.221 -4.017) (end 3.221 4.017) (layer "F.SilkS") (width 0.12) (tstamp f7d9ab14-92e8-4021-bd68-806bdc39ab6c))
  (fp_line (start 5.421 1.04) (end 5.421 2.867) (layer "F.SilkS") (width 0.12) (tstamp f7f697a1-cf09-4b35-844f-465bac01023f))
  (fp_line (start 5.421 -2.867) (end 5.421 -1.04) (layer "F.SilkS") (width 0.12) (tstamp fac924ab-0e1b-4a8d-82f5-504fd2b20445))
  (fp_line (start 4.941 -3.28) (end 4.941 -1.04) (layer "F.SilkS") (width 0.12) (tstamp fd08c1c2-4a0f-4a46-ac06-2b11b060dae5))
  (fp_line (start 4.301 1.04) (end 4.301 3.666) (layer "F.SilkS") (width 0.12) (tstamp fd73c9db-5800-4529-87d9-3eeb4c7bcc89))
  (fp_line (start 6.421 -1.229) (end 6.421 1.229) (layer "F.SilkS") (width 0.12) (tstamp fde3a365-a109-4c06-84da-7c91c2753b28))
  (fp_line (start 5.061 1.04) (end 5.061 3.189) (layer "F.SilkS") (width 0.12) (tstamp ff8c2209-13cb-409b-b274-7fb6af674be4))
  (fp_circle (center 2.5 0) (end 6.62 0) (layer "F.SilkS") (width 0.12) (fill none) (tstamp 2f909b0b-92ac-4d51-8c8b-0995145f46d6))
  (fp_circle (center 2.5 0) (end 6.75 0) (layer "F.CrtYd") (width 0.05) (fill none) (tstamp 1ece4645-a2a6-4010-88cf-70b9702913a6))
  (fp_line (start -0.926759 -1.7475) (end -0.126759 -1.7475) (layer "F.Fab") (width 0.1) (tstamp cf4762e2-f40c-4cab-8c94-16abd6552679))
  (fp_line (start -0.526759 -2.1475) (end -0.526759 -1.3475) (layer "F.Fab") (width 0.1) (tstamp d625d732-076e-4111-a912-ac4634915978))
  (fp_circle (center 2.5 0) (end 6.5 0) (layer "F.Fab") (width 0.1) (fill none) (tstamp 8b2b4aa9-bfab-462c-850d-be7947e4cf4f))
  (pad "1" thru_hole rect (at 0 0) (size 1.6 1.6) (drill 0.8) (layers *.Cu *.Mask) (tstamp ff2ea872-e8a9-4640-a4d9-1d67f80a28f3))
  (pad "2" thru_hole circle (at 5 0) (size 1.6 1.6) (drill 0.8) (layers *.Cu *.Mask) (tstamp 598ab58c-3acd-4a35-ba93-ef2bb2ab4480))
  (model "${KICAD6_3DMODEL_DIR}/Capacitor_THT.3dshapes/CP_Radial_D8.0mm_P5.00mm.wrl"
    (offset (xyz 0 0 0))
    (scale (xyz 1 1 1))
    (rotate (xyz 0 0 0))
  )
)
