(footprint "XH_P2.54_10" (version 20210722) (generator pcbnew) (layer "F.Cu")
  (tedit 6176B985)
  (descr "JST XH series connector, B20B-XH-A (http://www.jst-mfg.com/product/pdf/eng/eXH.pdf), generated with kicad-footprint-generator")
  (tags "connector JST XH side entry")
  (attr through_hole)
  (fp_text reference "REF**" (at 0 0) (layer "F.SilkS")
    (effects (font (size 1 1) (thickness 0.15)))
    (tstamp 1f232bc1-ddbc-48d7-947c-b40072ed54a7)
  )
  (fp_text value "XH_P2.54_10" (at 0 0) (layer "F.Fab")
    (effects (font (size 1 1) (thickness 0.15)))
    (tstamp 62194d17-7a0a-4f12-8541-a8efa787c7a8)
  )
  (fp_text user "${REFERENCE}" (at 0 0) (layer "F.Fab")
    (effects (font (size 1 1) (thickness 0.15)))
    (tstamp 45d95136-bceb-440b-91c7-350ef70701bd)
  )
  (fp_line (start -14.224 -2.794) (end -12.954 -2.794) (layer "F.SilkS") (width 0.1778) (tstamp 1f0dc923-497c-40d4-9a7d-029389fa20ae))
  (fp_line (start -13.208 2.794) (end 13.208 2.794) (layer "F.SilkS") (width 0.1778) (tstamp 3ebda7ed-1878-4816-b6ff-8bb804569166))
  (fp_line (start -13.97 -2.54) (end -13.97 3.556) (layer "F.SilkS") (width 0.1778) (tstamp 4d3ae5fb-0460-4a46-b972-b83908f512d6))
  (fp_line (start 13.97 -2.54) (end 13.97 3.556) (layer "F.SilkS") (width 0.1778) (tstamp 5c1d0e62-9220-4866-bd25-8bd847da83b6))
  (fp_line (start 13.208 -0.254) (end 13.208 2.794) (layer "F.SilkS") (width 0.1778) (tstamp 7f6bcf3a-d13b-442f-9d18-250150284cf9))
  (fp_line (start -13.97 3.556) (end 13.97 3.556) (layer "F.SilkS") (width 0.1778) (tstamp 93871e25-d3b0-468e-b67b-1983b3fcf24b))
  (fp_line (start 13.208 -0.254) (end 13.97 -0.254) (layer "F.SilkS") (width 0.1778) (tstamp 9a0e0a08-b625-4b30-864a-621ec8fdf2d0))
  (fp_line (start -13.208 -0.254) (end -13.208 2.794) (layer "F.SilkS") (width 0.1778) (tstamp b0ccccd7-1aeb-4598-a753-c6ef50ec97c8))
  (fp_line (start -14.224 -1.524) (end -14.224 -2.794) (layer "F.SilkS") (width 0.1778) (tstamp c2f682cf-54b1-413a-be26-e6b1d133331f))
  (fp_line (start -13.97 -0.254) (end -13.208 -0.254) (layer "F.SilkS") (width 0.1778) (tstamp d285c737-bf08-466d-a30c-dbf73a502ab6))
  (fp_rect (start -12.192 -1.778) (end -13.97 -2.54) (layer "F.SilkS") (width 0.1778) (fill none) (tstamp b4e403d6-f693-40e5-b7c2-5a1d2ad7cdf4))
  (fp_rect (start 12.192 -2.54) (end 13.97 -1.778) (layer "F.SilkS") (width 0.1778) (fill none) (tstamp c8e43ea3-6582-40a7-ad2d-6639f0ba8078))
  (fp_rect (start -10.668 -2.54) (end 10.668 -1.778) (layer "F.SilkS") (width 0.1778) (fill none) (tstamp d98fff61-0bc8-4fbe-9bfe-68b1baa75086))
  (fp_rect (start -14.478 -3.048) (end 14.478 4.064) (layer "F.CrtYd") (width 0.0254) (fill none) (tstamp ea7a6d85-fe31-49f7-ace2-6b0a5756858e))
  (fp_line (start -10.922 -2.54) (end -11.43 -2.032) (layer "F.Fab") (width 0.1) (tstamp 407a2338-7efc-4656-bff4-03b4d7a9d2e2))
  (fp_line (start -11.938 -2.54) (end -11.43 -2.032) (layer "F.Fab") (width 0.1) (tstamp f2480b5f-946e-4e20-9ab6-83e43f4054e1))
  (fp_rect (start -13.97 -2.54) (end 13.97 3.556) (layer "F.Fab") (width 0.1) (fill none) (tstamp 8b5c0096-c91a-4ebf-9aff-d32c3f783ea7))
  (pad "1" thru_hole roundrect locked (at -11.43 0) (size 1.778 2.032) (drill 1.016) (layers *.Cu *.Mask) (roundrect_rratio 0.15) (tstamp c68532be-84b7-4e04-a56e-745c8875fe1c))
  (pad "2" thru_hole oval locked (at -8.89 0) (size 1.778 2.032) (drill 1.016) (layers *.Cu *.Mask) (tstamp 077a8821-051e-4939-832a-2b94e7dfb7d2))
  (pad "3" thru_hole oval locked (at -6.35 0) (size 1.778 2.032) (drill 1.016) (layers *.Cu *.Mask) (tstamp 6bd37071-d063-4d50-8fcd-c50ee6680e5d))
  (pad "4" thru_hole oval (at -3.81 0) (size 1.778 2.032) (drill 1.016) (layers *.Cu *.Mask) (tstamp 147f8844-2db8-4078-a753-f2fff789b615))
  (pad "5" thru_hole oval (at -1.27 0) (size 1.778 2.032) (drill 1.016) (layers *.Cu *.Mask) (tstamp 52c55f75-4fe5-40fb-bc2a-e1634c5e1f77))
  (pad "6" thru_hole oval (at 1.27 0) (size 1.778 2.032) (drill 1.016) (layers *.Cu *.Mask) (tstamp d58c0d51-435b-4452-b09a-5238a421bc37))
  (pad "7" thru_hole oval (at 3.81 0) (size 1.778 2.032) (drill 1.016) (layers *.Cu *.Mask) (tstamp df0a1ecd-5fd6-4ef3-9f9c-7b6bed0e15f7))
  (pad "8" thru_hole oval (at 6.35 0) (size 1.778 2.032) (drill 1.016) (layers *.Cu *.Mask) (tstamp 9076ed70-e005-434b-a75a-3aa3ea30c271))
  (pad "9" thru_hole oval (at 8.89 0) (size 1.778 2.032) (drill 1.016) (layers *.Cu *.Mask) (tstamp 42af4a35-f39c-41c7-92a7-9e394bf3ac0e))
  (pad "10" thru_hole oval (at 11.43 0) (size 1.778 2.032) (drill 1.016) (layers *.Cu *.Mask) (tstamp 90d1bb9e-0cba-4902-a661-9826fc83e6db))
)
