(footprint "XH_P2.54_2" (version 20210722) (generator pcbnew) (layer "F.Cu")
  (tedit 617569C0)
  (descr "JST XH series connector, B20B-XH-A (http://www.jst-mfg.com/product/pdf/eng/eXH.pdf), generated with kicad-footprint-generator")
  (tags "connector JST XH side entry")
  (attr through_hole)
  (fp_text reference "REF**" (at 0 0) (layer "F.SilkS")
    (effects (font (size 1 1) (thickness 0.15)))
    (tstamp ef0b2293-4eef-4a5f-a6ba-f2687af045c2)
  )
  (fp_text value "XH_P2.54_2" (at 0 0) (layer "F.Fab")
    (effects (font (size 1 1) (thickness 0.15)))
    (tstamp 22c8ba39-54c4-4b3b-a59e-7a4c6ab3d4d7)
  )
  (fp_text user "${REFERENCE}" (at 0 0) (layer "F.Fab")
    (effects (font (size 1 1) (thickness 0.15)))
    (tstamp 8888d4c6-80a0-45ef-84a9-ae1234a6e973)
  )
  (fp_line (start -3.048 -0.254) (end -3.048 2.794) (layer "F.SilkS") (width 0.1778) (tstamp 3c276562-aa1c-4190-93d0-8d30ab8a309b))
  (fp_line (start -3.81 -0.254) (end -3.048 -0.254) (layer "F.SilkS") (width 0.1778) (tstamp 403ae408-9d31-4185-807a-3d9231582259))
  (fp_line (start -4.064 -2.794) (end -2.794 -2.794) (layer "F.SilkS") (width 0.1778) (tstamp 4c45e23f-3e52-45a1-86ff-bb9566bdb783))
  (fp_line (start -3.048 2.794) (end 3.048 2.794) (layer "F.SilkS") (width 0.1778) (tstamp 50bc31a1-a07c-4ced-a98b-c7ca1dba7f88))
  (fp_line (start -3.81 3.556) (end 3.81 3.556) (layer "F.SilkS") (width 0.1778) (tstamp 55ad857c-7944-4bc4-b947-d1a1fc0b532f))
  (fp_line (start -3.81 -2.54) (end -3.81 3.556) (layer "F.SilkS") (width 0.1778) (tstamp 74733d8c-4a6d-403b-bb29-51fd36351b69))
  (fp_line (start 3.81 -2.54) (end 3.81 3.556) (layer "F.SilkS") (width 0.1778) (tstamp 905ea72f-ec96-4bb2-a16f-f89506d3fddb))
  (fp_line (start -4.064 -1.524) (end -4.064 -2.794) (layer "F.SilkS") (width 0.1778) (tstamp ca1829d8-9bc1-4439-9401-bf2a78c38af3))
  (fp_line (start 3.048 -0.254) (end 3.81 -0.254) (layer "F.SilkS") (width 0.1778) (tstamp d8b3e9e2-2268-40eb-92d2-5b1066b937ba))
  (fp_line (start 3.048 -0.254) (end 3.048 2.794) (layer "F.SilkS") (width 0.1778) (tstamp f33fbc5f-e3f8-46b7-bf8e-e2b15c2e6f69))
  (fp_rect (start 2.032 -2.54) (end 3.81 -1.778) (layer "F.SilkS") (width 0.1778) (fill none) (tstamp 9e40181b-a333-4546-87f9-5da62819ed7b))
  (fp_rect (start -3.81 -2.54) (end -2.032 -1.778) (layer "F.SilkS") (width 0.1778) (fill none) (tstamp cb9be6e7-ad20-44d0-b6f0-710610c25b99))
  (fp_rect (start -4.318 -3.048) (end 4.318 4.064) (layer "F.CrtYd") (width 0.0254) (fill none) (tstamp 7380411c-3137-4c64-8f86-d727faaaf979))
  (fp_line (start -1.778 -2.54) (end -1.27 -2.032) (layer "F.Fab") (width 0.1) (tstamp 1ef0f84f-3025-42ff-bec0-dce0a4509922))
  (fp_line (start -0.762 -2.54) (end -1.27 -2.032) (layer "F.Fab") (width 0.1) (tstamp 29670e98-43ff-45f0-b83e-5d448f41261c))
  (fp_rect (start -3.81 -2.54) (end 3.81 3.556) (layer "F.Fab") (width 0.1) (fill none) (tstamp a4c179f2-1953-44f2-bfaf-5e273fb3e959))
  (pad "1" thru_hole roundrect locked (at -1.27 0) (size 1.778 2.032) (drill 1.016) (layers *.Cu *.Mask) (roundrect_rratio 0.15) (tstamp bc240534-63a6-4f60-9d0a-783d3adae901))
  (pad "2" thru_hole oval locked (at 1.27 0) (size 1.778 2.032) (drill 1.016) (layers *.Cu *.Mask) (tstamp fd4eab63-df0a-4111-95ea-264d18462de5))
)
