(footprint "USB_C_Receptacle_GCT_USB4105-GF-A" (version 20210722) (generator pcbnew) (layer "F.Cu")
  (tedit 617568C2)
  (descr "USB 2.0 Type C Receptacle, https://gct.co/Files/Drawings/USB4085.pdf")
  (tags "USB Type-C Receptacle Through-hole Right angle")
  (attr through_hole)
  (fp_text reference "REF**" (at 0 2.032) (layer "F.SilkS")
    (effects (font (size 1 1) (thickness 0.15)))
    (tstamp d9647b26-5577-4377-8f28-47414bf49bc4)
  )
  (fp_text value "USB_C_Receptacle_GCT_USB4105-GF-A" (at 0 8.636) (layer "F.Fab")
    (effects (font (size 1 1) (thickness 0.15)))
    (tstamp f507d65f-dbec-411c-b70d-a296e339c153)
  )
  (fp_text user "PCB Edge" (at 0 7.112) (layer "Dwgs.User")
    (effects (font (size 0.5 0.5) (thickness 0.1)))
    (tstamp 4b451839-fbdc-444b-b79b-0cfbaa38401e)
  )
  (fp_text user "${REFERENCE}" (at 2.975 4.025) (layer "F.Fab")
    (effects (font (size 1 1) (thickness 0.15)))
    (tstamp 1f0f0505-5c9c-473d-ab98-fe40c84c3fd1)
  )
  (fp_line (start -4.572 5.334) (end -4.572 6.604) (layer "F.SilkS") (width 0.1778) (tstamp 0cd7dc95-6d39-4fc0-b865-af89382cc567))
  (fp_line (start -4.572 6.604) (end 4.572 6.604) (layer "F.SilkS") (width 0.1778) (tstamp 276cd4f8-a24e-48cf-953b-4dffbe05c0f6))
  (fp_line (start 4.572 3.048) (end 4.572 1.27) (layer "F.SilkS") (width 0.1778) (tstamp 3fc2026d-0a25-45b9-96a6-27ebd8f6329e))
  (fp_line (start -4.572 3.048) (end -4.572 1.27) (layer "F.SilkS") (width 0.1778) (tstamp 4c83bae3-f820-40f3-8c79-a9e151d4740c))
  (fp_line (start 4.572 5.334) (end 4.572 6.604) (layer "F.SilkS") (width 0.1778) (tstamp 8dae8115-a286-4316-9184-590aaa51cdfb))
  (fp_rect (start -5.08 6.858) (end 5.08 -1.778) (layer "F.CrtYd") (width 0.0254) (fill none) (tstamp 2d019035-6ec2-4816-844d-95a3cc867d11))
  (fp_rect (start -4.572 6.604) (end 4.572 -1.27) (layer "F.Fab") (width 0.1) (fill none) (tstamp f91c36eb-9956-469f-9b4b-a416640c734a))
  (pad "" np_thru_hole circle locked (at -2.89 0.5) (size 0.65 0.65) (drill 0.65) (layers F&B.Cu *.Mask) (tstamp 87d61928-0f5e-4f55-b94d-64550a43618a))
  (pad "" np_thru_hole circle locked (at 2.89 0.5) (size 0.65 0.65) (drill 0.65) (layers F&B.Cu *.Mask) (tstamp d283b2fd-522b-4430-a6d9-62957e93c877))
  (pad "A1" smd rect (at -3.2 -0.8) (size 0.5 1.6) (layers "F.Cu" "F.Paste" "F.Mask")
    (solder_mask_margin 0.0762) (tstamp 21db4ddb-798e-4a70-abe2-279077d95bbf))
  (pad "A4" smd rect (at -2.4 -0.8) (size 0.5 1.6) (layers "F.Cu" "F.Paste" "F.Mask")
    (solder_mask_margin 0.0762) (tstamp 3faac8bc-c51b-40d9-968a-c9566542b2a9))
  (pad "A5" smd rect (at -1.25 -0.8) (size 0.25 1.6) (layers "F.Cu" "F.Paste" "F.Mask")
    (solder_mask_margin 0.0762) (tstamp 3927811e-73ce-4747-ba4d-45227f7638e8))
  (pad "A6" smd rect (at -0.25 -0.8) (size 0.25 1.6) (layers "F.Cu" "F.Paste" "F.Mask")
    (solder_mask_margin 0.0762) (tstamp bd255da3-a78e-4d54-b8ea-ed5733517c78))
  (pad "A7" smd rect (at 0.25 -0.8) (size 0.25 1.6) (layers "F.Cu" "F.Paste" "F.Mask")
    (solder_mask_margin 0.0762) (tstamp a59d67b8-0df2-4fa7-abfd-1e953286aced))
  (pad "A8" smd rect (at 1.25 -0.8) (size 0.25 1.6) (layers "F.Cu" "F.Paste" "F.Mask")
    (solder_mask_margin 0.0762) (tstamp f34dbaf6-bcec-4d9f-ad41-154dfc7c4770))
  (pad "B1" smd rect (at 3.2 -0.8) (size 0.5 1.6) (layers "F.Cu" "F.Paste" "F.Mask")
    (solder_mask_margin 0.0762) (tstamp 9030eb8a-d80c-4365-bc86-7ebb7e9b9739))
  (pad "B4" smd rect (at 2.4 -0.8) (size 0.5 1.6) (layers "F.Cu" "F.Paste" "F.Mask")
    (solder_mask_margin 0.0762) (tstamp f4791d56-5f9a-4773-8b82-b6c56db01904))
  (pad "B5" smd rect (at 1.75 -0.8) (size 0.25 1.6) (layers "F.Cu" "F.Paste" "F.Mask")
    (solder_mask_margin 0.0762) (tstamp 640c63c8-b2d4-4b66-9879-5571e3c3e845))
  (pad "B6" smd rect (at 0.75 -0.8) (size 0.25 1.6) (layers "F.Cu" "F.Paste" "F.Mask")
    (solder_mask_margin 0.0762) (tstamp 5fa49976-8cd5-411d-b7fe-5d871a6d5474))
  (pad "B7" smd rect (at -0.75 -0.8) (size 0.25 1.6) (layers "F.Cu" "F.Paste" "F.Mask")
    (solder_mask_margin 0.0762) (tstamp 12668e12-540d-415e-98fa-1bb09b0d5049))
  (pad "B8" smd rect (at -1.75 -0.8) (size 0.25 1.6) (layers "F.Cu" "F.Paste" "F.Mask")
    (solder_mask_margin 0.0762) (tstamp 956029e5-082e-4e42-a6c3-84c7625b8c58))
  (pad "SH" thru_hole oval (at -4.32 4.18) (size 1 1.8) (drill oval 0.6 1.4) (layers *.Cu *.Mask) (tstamp 2901c1ca-62e8-4da3-92a1-14c7fe318ef1))
  (pad "SH" thru_hole oval (at 4.32 4.18) (size 1 1.8) (drill oval 0.6 1.4) (layers *.Cu *.Mask) (tstamp 8b7ddb2d-efa3-4ace-ad06-6deb718eff69))
  (pad "SH" thru_hole oval (at -4.32 0) (size 1 2.1) (drill oval 0.6 1.7) (layers *.Cu *.Mask) (tstamp c1a31fbf-38e8-4013-adbd-3939582d6b25))
  (pad "SH" thru_hole oval (at 4.32 0) (size 1 2.1) (drill oval 0.6 1.7) (layers *.Cu *.Mask) (tstamp ee65ff53-fa9e-43f3-ae3f-42c73d445649))
  (model "${ONEKIWI_3DMODEL_DIR}/Connector_USB.3dshapes/USB4105-GF-A.STEP"
    (offset (xyz 0 -7 0))
    (scale (xyz 1 1 1))
    (rotate (xyz 90 180 180))
  )
)
