(footprint "PCB_P2.0_1x5" (version 20211014) (generator pcbnew) (layer "F.Cu")
  (tedit 617A04AB)
  (descr "Through hole straight pin header, 1x20, 2.54mm pitch, single row")
  (tags "Through hole pin header THT 1x20 2.54mm single row")
  (attr through_hole)
  (fp_text reference "REF**" (at 0 0 90) (layer "F.SilkS")
    (effects (font (size 1.016 1.016) (thickness 0.1778)))
    (tstamp 1b48a5f1-081d-4ccf-8b22-d178dd8083a4)
  )
  (fp_text value "PCB_P2.0_1x5" (at 0 0 90) (layer "F.Fab")
    (effects (font (size 1 1) (thickness 0.15)))
    (tstamp b684b518-8862-49d0-aed8-cd99259ce895)
  )
  (fp_text user "${REFERENCE}" (at 0 0 90) (layer "F.Fab")
    (effects (font (size 1 1) (thickness 0.15)))
    (tstamp 768995bf-7db1-4fac-8b23-2e16a271592f)
  )
  (fp_rect (start -1 -5) (end 1 5) (layer "F.SilkS") (width 0.1778) (fill none) (tstamp 7d2b1383-c855-45b0-911a-842113d82da1))
  (fp_rect (start -1 -5) (end 1 5) (layer "F.CrtYd") (width 0.0254) (fill none) (tstamp a465173a-76b4-480e-916f-7ee9647c1d47))
  (fp_rect (start -1 -5) (end 1 5) (layer "F.Fab") (width 0.1) (fill none) (tstamp c758a40e-cb81-43b4-a76c-0776b0802c8f))
  (pad "1" smd rect locked (at 0 -4) (size 1 1.27) (layers "F.Cu" "F.Paste" "F.Mask")
    (solder_mask_margin 0.0762) (tstamp 82f30c56-29c8-43ec-b686-8d19292ddb21))
  (pad "2" smd rect locked (at 0 -2) (size 1 1.27) (layers "F.Cu" "F.Paste" "F.Mask")
    (solder_mask_margin 0.0762) (tstamp 352c3159-6cab-4e57-a402-761e46ce9004))
  (pad "3" smd rect locked (at 0 0) (size 1 1.27) (layers "F.Cu" "F.Paste" "F.Mask")
    (solder_mask_margin 0.0762) (tstamp 1b94a389-23fe-4c73-9c22-d25c55408a5e))
  (pad "4" smd rect locked (at 0 2) (size 1 1.27) (layers "F.Cu" "F.Paste" "F.Mask")
    (solder_mask_margin 0.0762) (tstamp 81ae8db2-f1cd-420c-b0af-a0a87b19b991))
  (pad "5" smd rect locked (at 0 4) (size 1 1.27) (layers "F.Cu" "F.Paste" "F.Mask")
    (solder_mask_margin 0.0762) (tstamp b4ebef2b-dbef-49d2-baaf-de948dd03c74))
)
