{
  "project_info": {
    "project_number": "901030438286",
    "firebase_url": "https://grocerystoreo-default-rtdb.firebaseio.com",
    "project_id": "grocerystoreo",
    "storage_bucket": "grocerystoreo.appspot.com"
  },
  "client": [
    {
      "client_info": {
        "mobilesdk_app_id": "1:901030438286:android:8479bc1e32ded60c98b0df",
        "android_client_info": {
          "package_name": "com.example.groceryNew"
        }
      },
      "oauth_client": [
        {
          "client_id": "901030438286-52junk7fuau2dlsmaqq3ke1of4dvpek5.apps.googleusercontent.com",
          "client_type": 1,
          "android_info": {
            "package_name": "com.example.groceryNew",
            "certificate_hash": "cfef66e6a4d69db8784a4c7d2bbb2e54ea16e9d5"
          }
        },
        {
          "client_id": "901030438286-h0qrnqh1rtamo7ch97qmr39859s144tb.apps.googleusercontent.com",
          "client_type": 3
        }
      ],
      "api_key": [
        {
          "current_key": "AIzaSyCdQGFtOpagRZX0aPK9QwhX5ZedGwvmAEw"
        }
      ],
      "services": {
        "appinvite_service": {
          "other_platform_oauth_client": [
            {
              "client_id": "901030438286-h0qrnqh1rtamo7ch97qmr39859s144tb.apps.googleusercontent.com",
              "client_type": 3
            }
          ]
        }
      }
    },
    {
      "client_info": {
        "mobilesdk_app_id": "1:901030438286:android:c7c96c15224544f398b0df",
        "android_client_info": {
          "package_name": "com.onedev.admin"
        }
      },
      "oauth_client": [
        {
          "client_id": "901030438286-h0qrnqh1rtamo7ch97qmr39859s144tb.apps.googleusercontent.com",
          "client_type": 3
        }
      ],
      "api_key": [
        {
          "current_key": "AIzaSyCdQGFtOpagRZX0aPK9QwhX5ZedGwvmAEw"
        }
      ],
      "services": {
        "appinvite_service": {
          "other_platform_oauth_client": [
            {
              "client_id": "901030438286-h0qrnqh1rtamo7ch97qmr39859s144tb.apps.googleusercontent.com",
              "client_type": 3
            }
          ]
        }
      }
    },
    {
      "client_info": {
        "mobilesdk_app_id": "1:901030438286:android:10785ecce03b8dcc98b0df",
        "android_client_info": {
          "package_name": "com.onedev.delivery"
        }
      },
      "oauth_client": [
        {
          "client_id": "901030438286-h0qrnqh1rtamo7ch97qmr39859s144tb.apps.googleusercontent.com",
          "client_type": 3
        }
      ],
      "api_key": [
        {
          "current_key": "AIzaSyCdQGFtOpagRZX0aPK9QwhX5ZedGwvmAEw"
        }
      ],
      "services": {
        "appinvite_service": {
          "other_platform_oauth_client": [
            {
              "client_id": "901030438286-h0qrnqh1rtamo7ch97qmr39859s144tb.apps.googleusercontent.com",
              "client_type": 3
            }
          ]
        }
      }
    },
    {
      "client_info": {
        "mobilesdk_app_id": "1:901030438286:android:aca9c537dcfd564a98b0df",
        "android_client_info": {
          "package_name": "com.slownett.deliveryNew"
        }
      },
      "oauth_client": [
        {
          "client_id": "901030438286-h0qrnqh1rtamo7ch97qmr39859s144tb.apps.googleusercontent.com",
          "client_type": 3
        }
      ],
      "api_key": [
        {
          "current_key": "AIzaSyCdQGFtOpagRZX0aPK9QwhX5ZedGwvmAEw"
        }
      ],
      "services": {
        "appinvite_service": {
          "other_platform_oauth_client": [
            {
              "client_id": "901030438286-h0qrnqh1rtamo7ch97qmr39859s144tb.apps.googleusercontent.com",
              "client_type": 3
            }
          ]
        }
      }
    }
  ],
  "configuration_version": "1"
}