@startuml
state HELD as "//HELD//" {
    state PSUSP
}
state PENDING as "//PENDING//"{
   state PEND
}

state RUNNING as "//RUNNING//" {
   state RUN
}

state PAUSED as "//PAUSED//" {
   state USUSP
   state SSUSP

   USUSP -> SSUSP: bresume
   SSUSP -> USUSP: bstop
}
state SUCCEEDED as "//SUCCEEDED//" {
  state DONE
}
state FAILED as "//FAILED//" {
  state EXIT
}
state CANCELED as "//CANCELED//" {
  state CANCELED_LSF as "CANCELED"
}
SUCCEEDED -[hidden]right-> FAILED
FAILED -[hidden]right-> CANCELED

state SYSTEM_ERROR as "//SYSTEM_ERROR//"
note top: Transitions from all states possible.

[*] -down-> PEND: bsub
PENDING -[hidden]down-> RUNNING
RUNNING -[hidden]down-> PAUSED

PEND -right-> PSUSP: bstop
PSUSP -up-> PEND: resume
PEND -down-> RUN: suitable host
RUN -up-> PEND: migration

RUN -down-> SSUSP: host\noverloaded
SSUSP -up-> RUN: host\nOK
RUN -down-> USUSP: bstop

PEND -right-> EXIT: bkill
RUN -right-> EXIT: exit>0
RUN -right-> CANCELED_LSF: bkill
USUSP -right-> EXIT: bkill
SSUSP -right-> EXIT: bkill
PSUSP -right-> EXIT: bkill
RUN -right-> DONE: exit=0

FAILED -down-> [*]
CANCELED -down-> [*]
SUCCEEDED -down-> [*]
SYSTEM_ERROR -down-> [*]
@enduml
