module gitlab.com/one-odin/together/server/cfg

go 1.19

require github.com/savsgio/atreugo/v11 v11.9.7

require (
	github.com/andybalholm/brotli v1.0.4 // indirect
	github.com/fasthttp/router v1.4.12 // indirect
	github.com/klauspost/compress v1.15.0 // indirect
	github.com/savsgio/gotils v0.0.0-20220530130905-52f3993e8d6d // indirect
	github.com/valyala/bytebufferpool v1.0.0 // indirect
	github.com/valyala/fasthttp v1.40.0 // indirect
	github.com/valyala/tcplisten v1.0.0 // indirect
	golang.org/x/sys v0.0.0-20220227234510-4e6760a101f9 // indirect
)
