@startuml
title Frontend component class diagram

class GameContainer << (C,red) container>> {
    ==state==
    game: Game
}

class PlayerControl << (C,blue) component >> {
    ==props==
    player: ControllingPlayer
}

class PlayerHandControl << (C,blue) component >> {
    ==props==
    cards: Card[]
}

class PlayerTableControl << (C,blue) component >> {
    ==props==
    cards: Card[]
}

class PlayerCharacterControl << (C,blue) component >> {
    ==props==
    hp: number
    character: Character
}

class TargetPlayerControl << (C,blue) component >> {
    ==props==
    player: Player
}

class TargetPlayerHandControl << (C,blue) component >> {
    ==props==
    cardsCount: number
}

class TargetPlayerTableControl << (C,blue) component >> {
    ==props==
    cards: Card[]
}

class TargetPlayerRoleControl << (C,blue) component >> {
    ==props==
    role?: Role
}

class TargetPlayerCharacterControl << (C,blue) component >> {
    ==props==
    character: Character
}

class EventControl << (C,blue) component >> {
    ==props==
    event: Event
}

class DrawControl << (C,blue) component >>

class PassControl << (C,blue) component >>
class EndTurnControl << (C,blue) component >>


GameContainer --|| PlayerControl
GameContainer --|{ TargetPlayerControl
GameContainer --o| EventControl
GameContainer --|| DrawControl
GameContainer --|| PassControl
GameContainer --o| EndTurnControl

PlayerControl --o{ PlayerHandControl
PlayerControl --o{ PlayerTableControl
PlayerControl --|| PlayerCharacterControl

TargetPlayerControl --o| TargetPlayerHandControl
TargetPlayerControl --o{ TargetPlayerTableControl
TargetPlayerControl --|| TargetPlayerCharacterControl
TargetPlayerControl --|| TargetPlayerRoleControl

@enduml