{
	"_id" : "syYPWgNG5GnxLNHmB",
	"rid" : "GENERAL",
	"msg" : "Welcome to the Benocs RocketChat!",
	"ts" : ISODate("2017-07-21T18:25:23.957Z"),
	"u" : {
		"_id" : "zxq7ffHL4SJRvSnd2",
		"username" : "dlevin",
		"name" : "Dan"
	},
	"mentions" : [ ],
	"channels" : [ ],
	"_updatedAt" : ISODate("2019-05-06T07:52:11.524Z")
}
// File containing message
{
	"_id" : "2svxqGJZCaJBXW2LN",
	"rid" : "GENERAL",
	"ts" : ISODate("2017-07-21T18:27:38.915Z"),
	"msg" : "",
	"file" : {
		"_id" : "zHiwQi5znqAJevW84",
		"name" : "IMG_20170707_110934.jpg"
	},
	"groupable" : false,
	"attachments" : [
		{
			"title" : "File Uploaded: IMG_20170707_110934.jpg",
			"description" : "Benocs Chat sets sail!",
			"title_link" : "/file-upload/zHiwQi5znqAJevW84/IMG_20170707_110934.jpg",
			"title_link_download" : true,
			"image_url" : "/file-upload/zHiwQi5znqAJevW84/IMG_20170707_110934.jpg",
			"image_type" : "image/jpeg",
			"image_size" : 868336
		}
	],
	"u" : {
		"_id" : "zxq7ffHL4SJRvSnd2",
		"username" : "dlevin",
		"name" : "Dan"
	},
	"mentions" : [ ],
	"channels" : [ ],
	"_updatedAt" : ISODate("2019-05-06T07:52:14.243Z"),
	"editedAt" : ISODate("2017-07-21T18:58:42.729Z"),
	"editedBy" : {
		"_id" : "zxq7ffHL4SJRvSnd2",
		"username" : "dlevin"
	}
}


// curl 'https://chat.benocs.com//file-upload/Ss7L3YCBHjTxrjGBr/IMG_2477.JPG' -H 'Cookie: experimentation_subject_id=IjZjMjA1Njc2LWYxOGUtNDMyNy1iZWMyLTRmZWFjOWRiODg0MiI%3D--d4fcf51873b9ccf0b65ba1deebbba3f430e38518; rc_uid=ivwNbZBZwFKkB9F82; rc_token=Y78cNlcO8TSaEngdFijKM9K8UicIT4Na3fi_eC2TAQZ'