{
  "zerver_message": [
    {
      "id":8,
      "sender":7,
      "recipient":8,
      "subject":"swimming turtles",
      "content":"This is a message on stream #**general** with the topic `swimming turtles`. \n\n[](\/static\/images\/cute\/turtle.png)\n\n[Start a new topic](\/help\/start-a-new-topic) any time you're not replying to a previous message.",
      "rendered_content":"<p>This is a message on stream <a class=\"stream\" data-stream-id=\"1\" href=\"\/#narrow\/stream\/1-general\">#general<\/a> with the topic <code>swimming turtles<\/code>. <\/p>\n<div class=\"message_inline_image\"><a href=\"\/static\/images\/cute\/turtle.png\" target=\"_blank\" title=\"\/static\/images\/cute\/turtle.png\"><img src=\"\/static\/images\/cute\/turtle.png\"><\/a><\/div><p><a href=\"\/help\/start-a-new-topic\" target=\"_blank\" title=\"\/help\/start-a-new-topic\">Start a new topic<\/a> any time you're not replying to a previous message.<\/p>",
      "rendered_content_version":1,
      "date_sent":1592831903.1534490585,
      "sending_client":3,
      "last_edit_time":null,
      "edit_history":null,
      "has_attachment":false,
      "has_image":true,
      "has_link":true
    }
  ]
}

// from zerver.models import Message, Client, UserProfile
// from zerver.lib import render_markdown
/*
Recipient:
Functions:
def map_rocket_user_to_zulip_id(sender) -> UserProfile
def map_rocket_channel_to_zulip_recepient(rocket_chat.channel) -> Recipient
         // get the recipient object from the server
Required:
realm_id to be importend into
Mapping:
client = Client.objects.all()[0]
message = Message()
message.content = rocket_chat.msg
message.rendered_content = render_markdown(rocket_chat.msg)
message.sender = map_rocket_user_to_zulip_id(rocket_chat.sender)
message.recipient = map_rocket_channel_to_zulip_recepient(rocket_chat.channel)
message.subject = rocket_chosen_topic_for_migration(rocket_chat.channel)
message.sending_client

*/