{
  "__inputs": [
    {
      "name": "DS_TELEGRAF",
      "label": "telegraf",
      "description": "",
      "type": "datasource",
      "pluginId": "influxdb",
      "pluginName": "InfluxDB"
    }
  ],
  "__requires": [
    {
      "type": "panel",
      "id": "graph",
      "name": "Graph",
      "version": ""
    },
    {
      "type": "grafana",
      "id": "grafana",
      "name": "Grafana",
      "version": "4.1.0-pre1"
    },
    {
      "type": "datasource",
      "id": "influxdb",
      "name": "InfluxDB",
      "version": "1.0.0"
    }
  ],
  "id": null,
  "title": "Servers",
  "description": "Servers monitoring",
  "tags": [
    "digitalocean"
  ],
  "style": "dark",
  "timezone": "browser",
  "editable": true,
  "sharedCrosshair": false,
  "hideControls": false,
  "time": {
    "from": "now-30m",
    "to": "now"
  },
  "timepicker": {
    "refresh_intervals": [
      "1s",
      " 5s",
      "10s",
      "30s",
      "1m",
      "5m",
      "15m",
      "30m",
      "1h",
      "2h",
      "1d"
    ],
    "time_options": [
      "5m",
      "15m",
      "1h",
      "6h",
      "12h",
      "24h",
      "2d",
      "7d",
      "30d"
    ]
  },
  "templating": {
    "list": [
      {
        "allValue": null,
        "current": {},
        "datasource": "${DS_TELEGRAF}",
        "hide": 0,
        "includeAll": false,
        "label": null,
        "multi": true,
        "name": "host",
        "options": [],
        "query": "SHOW TAG VALUES WITH KEY = host",
        "refresh": 1,
        "regex": "",
        "sort": 0,
        "tagValuesQuery": null,
        "tagsQuery": null,
        "type": "query"
      },
      {
        "allValue": null,
        "current": {},
        "datasource": "${DS_TELEGRAF}",
        "hide": 0,
        "includeAll": false,
        "label": null,
        "multi": true,
        "name": "path",
        "options": [],
        "query": "SHOW TAG VALUES WITH KEY = path",
        "refresh": 1,
        "regex": "",
        "sort": 0,
        "tagValuesQuery": null,
        "tagsQuery": null,
        "type": "query"
      }
    ]
  },
  "annotations": {
    "list": []
  },
  "refresh": false,
  "schemaVersion": 13,
  "version": 29,
  "links": [
    {
      "icon": "external link",
      "tags": [
        "digitalocean"
      ],
      "type": "dashboards"
    }
  ],
  "gnetId": null,
  "rows": [
    {
      "title": "Dashboard Row",
      "panels": [
        {
          "aliasColors": {
            "cpu.usage_system": "#447EBC"
          },
          "bars": false,
          "datasource": "${DS_TELEGRAF}",
          "editable": true,
          "error": false,
          "fill": 1,
          "id": 1,
          "legend": {
            "alignAsTable": true,
            "avg": true,
            "current": true,
            "max": true,
            "min": true,
            "rightSide": false,
            "show": true,
            "total": false,
            "values": true
          },
          "lines": true,
          "linewidth": 1,
          "links": [],
          "nullPointMode": "null",
          "percentage": false,
          "pointradius": 5,
          "points": false,
          "renderer": "flot",
          "seriesOverrides": [
            {
              "alias": "cpu.usage_system",
              "yaxis": 1
            }
          ],
          "span": 6,
          "stack": false,
          "steppedLine": false,
          "targets": [
            {
              "dsType": "influxdb",
              "groupBy": [
                {
                  "params": [
                    "host"
                  ],
                  "type": "tag"
                }
              ],
              "measurement": "cpu",
              "policy": "default",
              "refId": "A",
              "resultFormat": "time_series",
              "select": [
                [
                  {
                    "params": [
                      "usage_system"
                    ],
                    "type": "field"
                  }
                ]
              ],
              "tags": [
                {
                  "key": "host",
                  "operator": "=~",
                  "value": "/^$host$/"
                }
              ]
            },
            {
              "dsType": "influxdb",
              "groupBy": [
                {
                  "params": [
                    "host"
                  ],
                  "type": "tag"
                }
              ],
              "hide": false,
              "measurement": "cpu",
              "policy": "default",
              "refId": "B",
              "resultFormat": "time_series",
              "select": [
                [
                  {
                    "params": [
                      "usage_user"
                    ],
                    "type": "field"
                  }
                ]
              ],
              "tags": [
                {
                  "key": "host",
                  "operator": "=~",
                  "value": "/^$host$/"
                }
              ]
            }
          ],
          "thresholds": [
            {
              "colorMode": "critical",
              "fill": true,
              "line": true,
              "op": "gt",
              "value": 60
            }
          ],
          "timeFrom": null,
          "timeShift": null,
          "title": "CPU",
          "tooltip": {
            "shared": true,
            "sort": 0,
            "value_type": "individual"
          },
          "type": "graph",
          "xaxis": {
            "mode": "time",
            "name": null,
            "show": true,
            "values": []
          },
          "yaxes": [
            {
              "format": "percent",
              "label": null,
              "logBase": 1,
              "max": null,
              "min": null,
              "show": true
            },
            {
              "format": "short",
              "label": null,
              "logBase": 1,
              "max": null,
              "min": null,
              "show": true
            }
          ]
        },
        {
          "aliasColors": {
            "mem.total": "#BF1B00"
          },
          "bars": false,
          "datasource": "${DS_TELEGRAF}",
          "editable": true,
          "error": false,
          "fill": 1,
          "id": 2,
          "legend": {
            "alignAsTable": true,
            "avg": true,
            "current": true,
            "max": true,
            "min": true,
            "rightSide": false,
            "show": true,
            "total": false,
            "values": true
          },
          "lines": true,
          "linewidth": 1,
          "links": [],
          "nullPointMode": "null",
          "percentage": false,
          "pointradius": 5,
          "points": false,
          "renderer": "flot",
          "seriesOverrides": [
            {
              "alias": "mem.total",
              "fill": 0
            },
            {
              "alias": "mem.used_percent",
              "yaxis": 1
            },
            {
              "alias": "mem.used",
              "yaxis": 2
            },
            {
              "alias": "mem.used {host: do-docker1}",
              "yaxis": 2
            }
          ],
          "span": 6,
          "stack": false,
          "steppedLine": false,
          "targets": [
            {
              "dsType": "influxdb",
              "groupBy": [
                {
                  "params": [
                    "host"
                  ],
                  "type": "tag"
                }
              ],
              "hide": false,
              "measurement": "mem",
              "policy": "autogen",
              "refId": "A",
              "resultFormat": "time_series",
              "select": [
                [
                  {
                    "params": [
                      "used"
                    ],
                    "type": "field"
                  }
                ]
              ],
              "tags": [
                {
                  "key": "host",
                  "operator": "=~",
                  "value": "/^$host$/"
                }
              ]
            },
            {
              "dsType": "influxdb",
              "groupBy": [
                {
                  "params": [
                    "host"
                  ],
                  "type": "tag"
                }
              ],
              "hide": false,
              "measurement": "mem",
              "policy": "default",
              "refId": "B",
              "resultFormat": "time_series",
              "select": [
                [
                  {
                    "params": [
                      "used_percent"
                    ],
                    "type": "field"
                  }
                ]
              ],
              "tags": [
                {
                  "key": "host",
                  "operator": "=~",
                  "value": "/^$host$/"
                }
              ]
            }
          ],
          "thresholds": [
            {
              "colorMode": "critical",
              "fill": true,
              "line": true,
              "op": "gt",
              "value": 50
            }
          ],
          "timeFrom": null,
          "timeShift": null,
          "title": "Mem",
          "tooltip": {
            "shared": true,
            "sort": 0,
            "value_type": "individual"
          },
          "type": "graph",
          "xaxis": {
            "mode": "time",
            "name": null,
            "show": true,
            "values": []
          },
          "yaxes": [
            {
              "format": "percent",
              "label": null,
              "logBase": 1,
              "max": null,
              "min": null,
              "show": true
            },
            {
              "format": "decbytes",
              "label": "",
              "logBase": 1,
              "max": null,
              "min": null,
              "show": true
            }
          ]
        }
      ],
      "showTitle": false,
      "titleSize": "h6",
      "height": 431,
      "repeat": null,
      "repeatRowId": null,
      "repeatIteration": null,
      "collapse": false
    },
    {
      "title": "Dashboard Row",
      "panels": [
        {
          "aliasColors": {},
          "bars": false,
          "datasource": "${DS_TELEGRAF}",
          "editable": true,
          "error": false,
          "fill": 1,
          "id": 3,
          "legend": {
            "alignAsTable": true,
            "avg": true,
            "current": true,
            "max": true,
            "min": true,
            "rightSide": false,
            "show": true,
            "total": false,
            "values": true
          },
          "lines": true,
          "linewidth": 1,
          "links": [],
          "nullPointMode": "null",
          "percentage": false,
          "pointradius": 5,
          "points": false,
          "renderer": "flot",
          "seriesOverrides": [],
          "span": 6,
          "stack": false,
          "steppedLine": false,
          "targets": [
            {
              "alias": "Recive $host",
              "dsType": "influxdb",
              "groupBy": [
                {
                  "params": [
                    "host"
                  ],
                  "type": "tag"
                }
              ],
              "measurement": "net",
              "policy": "autogen",
              "refId": "A",
              "resultFormat": "time_series",
              "select": [
                [
                  {
                    "params": [
                      "bytes_recv"
                    ],
                    "type": "field"
                  },
                  {
                    "params": [
                      "1s"
                    ],
                    "type": "derivative"
                  }
                ]
              ],
              "tags": [
                {
                  "key": "interface",
                  "operator": "=",
                  "value": "eth0"
                },
                {
                  "condition": "AND",
                  "key": "host",
                  "operator": "=~",
                  "value": "/^$host$/"
                }
              ]
            },
            {
              "alias": "Sent $host",
              "dsType": "influxdb",
              "groupBy": [
                {
                  "params": [
                    "host"
                  ],
                  "type": "tag"
                }
              ],
              "measurement": "net",
              "policy": "autogen",
              "refId": "B",
              "resultFormat": "time_series",
              "select": [
                [
                  {
                    "params": [
                      "bytes_sent"
                    ],
                    "type": "field"
                  },
                  {
                    "params": [
                      "1s"
                    ],
                    "type": "derivative"
                  }
                ]
              ],
              "tags": [
                {
                  "key": "interface",
                  "operator": "=",
                  "value": "eth0"
                },
                {
                  "condition": "AND",
                  "key": "host",
                  "operator": "=~",
                  "value": "/^$host$/"
                }
              ]
            }
          ],
          "thresholds": [],
          "timeFrom": null,
          "timeShift": null,
          "title": "Network",
          "tooltip": {
            "shared": true,
            "sort": 0,
            "value_type": "individual"
          },
          "type": "graph",
          "xaxis": {
            "mode": "time",
            "name": null,
            "show": true,
            "values": [
              "total"
            ]
          },
          "yaxes": [
            {
              "format": "Bps",
              "label": null,
              "logBase": 1,
              "max": null,
              "min": null,
              "show": true
            },
            {
              "format": "Bps",
              "label": null,
              "logBase": 1,
              "max": null,
              "min": null,
              "show": true
            }
          ]
        },
        {
          "aliasColors": {},
          "bars": false,
          "datasource": "${DS_TELEGRAF}",
          "editable": true,
          "error": false,
          "fill": 1,
          "id": 4,
          "interval": "",
          "legend": {
            "alignAsTable": true,
            "avg": true,
            "current": true,
            "max": true,
            "min": true,
            "rightSide": false,
            "show": true,
            "total": false,
            "values": true
          },
          "lines": true,
          "linewidth": 1,
          "links": [],
          "nullPointMode": "null",
          "percentage": false,
          "pointradius": 5,
          "points": false,
          "renderer": "flot",
          "seriesOverrides": [
            {
              "alias": "/disk.used_percent.*/",
              "yaxis": 1
            },
            {
              "alias": "/disk.total.*/",
              "yaxis": 2
            }
          ],
          "span": 6,
          "stack": false,
          "steppedLine": false,
          "targets": [
            {
              "alias": "",
              "dsType": "influxdb",
              "groupBy": [
                {
                  "params": [
                    "path"
                  ],
                  "type": "tag"
                },
                {
                  "params": [
                    "host"
                  ],
                  "type": "tag"
                }
              ],
              "interval": "",
              "measurement": "disk",
              "policy": "autogen",
              "refId": "A",
              "resultFormat": "time_series",
              "select": [
                [
                  {
                    "params": [
                      "used_percent"
                    ],
                    "type": "field"
                  }
                ]
              ],
              "tags": [
                {
                  "key": "host",
                  "operator": "=~",
                  "value": "/^$host$/"
                },
                {
                  "condition": "AND",
                  "key": "path",
                  "operator": "=~",
                  "value": "/^$path$/"
                }
              ]
            },
            {
              "alias": "",
              "dsType": "influxdb",
              "groupBy": [
                {
                  "params": [
                    "path"
                  ],
                  "type": "tag"
                },
                {
                  "params": [
                    "host"
                  ],
                  "type": "tag"
                }
              ],
              "measurement": "disk",
              "policy": "autogen",
              "refId": "B",
              "resultFormat": "time_series",
              "select": [
                [
                  {
                    "params": [
                      "total"
                    ],
                    "type": "field"
                  }
                ]
              ],
              "tags": [
                {
                  "key": "host",
                  "operator": "=~",
                  "value": "/^$host$/"
                },
                {
                  "condition": "AND",
                  "key": "path",
                  "operator": "=~",
                  "value": "/^$path$/"
                }
              ]
            }
          ],
          "thresholds": [
            {
              "colorMode": "critical",
              "fill": true,
              "line": true,
              "op": "gt",
              "value": 50
            }
          ],
          "timeFrom": null,
          "timeShift": null,
          "title": "Disk",
          "tooltip": {
            "shared": true,
            "sort": 0,
            "value_type": "individual"
          },
          "type": "graph",
          "xaxis": {
            "mode": "time",
            "name": null,
            "show": true,
            "values": [
              "total"
            ]
          },
          "yaxes": [
            {
              "format": "percent",
              "label": null,
              "logBase": 1,
              "max": null,
              "min": null,
              "show": true
            },
            {
              "format": "decbytes",
              "label": null,
              "logBase": 1,
              "max": null,
              "min": null,
              "show": true
            }
          ]
        }
      ],
      "showTitle": false,
      "titleSize": "h6",
      "height": 428,
      "repeat": null,
      "repeatRowId": null,
      "repeatIteration": null,
      "collapse": false
    },
    {
      "title": "Dashboard Row",
      "panels": [],
      "showTitle": false,
      "titleSize": "h6",
      "height": 250,
      "repeat": null,
      "repeatRowId": null,
      "repeatIteration": null,
      "collapse": false
    }
  ]
}