{
  "defaultSeverity": "error",
  "extends": [
    "tslint:recommended"
  ],
  "jsRules": {},
  "rules": {
    "trailing-comma": [ false ],
    "no-console": [ false ],
    "no-any": [ true ],
    "no-unsafe-any": [ false ],
    "no-shadowed-variable": [ false ]
  },
  "rulesDirectory": []
}