{
  "project_info": {
    "project_number": "456644665662",
    "project_id": "default-demo-app-81145"
  },
  "client": [
    {
      "client_info": {
        "mobilesdk_app_id": "1:456644665662:android:1afe245829621f98",
        "android_client_info": {
          "package_name": "com.oksin.video.pepevideolari"
        }
      },
      "oauth_client": [],
      "api_key": [
        {
          "current_key": "AIzaSyABvpcxcS1J42IDbBalfNO3Rc9XmeeZ8G0"
        }
      ],
      "services": {
        "analytics_service": {
          "status": 2,
          "analytics_property": {
            "tracking_id": "UA-85535072-4"
          }
        },
        "appinvite_service": {
          "status": 1,
          "other_platform_oauth_client": []
        },
        "ads_service": {
          "status": 1
        }
      }
    }
  ],
  "configuration_version": "1"
}