<svg width="86" height="86" viewBox="0 0 86 86" fill="none" xmlns="http://www.w3.org/2000/svg">
<g clip-path="url(#clip0_1_395)">
<mask id="mask0_1_395" style="mask-type:alpha" maskUnits="userSpaceOnUse" x="0" y="0" width="86" height="86">
<path d="M0 30.0246C0 14.8691 0 9.41638 4.70819 4.70819C9.41638 0 14.8691 0 32.1495 0H53.8505C71.1308 0 76.5836 0 81.2918 4.70819C86 9.41638 86 14.8691 86 32.1495V53.8505C86 71.1308 86 76.5836 81.2918 81.2918C76.5836 86 71.1308 86 53.8505 86H32.1495C14.8691 86 9.41638 86 4.70819 81.2918C0 76.5836 0 71.1308 0 53.8505V30.0246Z" fill="white"/>
</mask>
<g mask="url(#mask0_1_395)">
<rect width="86" height="86" fill="url(#paint0_radial_1_395)"/>
</g>
<g clip-path="url(#clip1_1_395)">
<path d="M75 43C75 60.6731 60.6731 75 43 75C25.3269 75 11 60.6731 11 43C11 25.3269 25.3269 11 43 11C60.6731 11 75 25.3269 75 43Z" fill="white" fill-opacity="0.36"/>
<path d="M34.0657 41.5104L26.1347 27.7975C31.2847 22.1534 38.6366 19.4867 46.184 20.5175L34.0657 41.5104Z" fill="white"/>
<path fill-rule="evenodd" clip-rule="evenodd" d="M47.3792 20.7161C54.8163 22.1798 60.9658 27.227 63.9273 34.1689L39.614 34.1669L47.3792 20.7161Z" fill="white"/>
<path d="M21.3887 49.9693C19.0451 42.6467 20.5383 34.6885 25.3556 28.713L37.651 49.9723L21.3887 49.9693Z" fill="white"/>
<path d="M61.095 56.7197L48.7321 35.2954L64.3664 35.2964C64.3941 35.3608 64.4195 35.4268 64.4427 35.4944C66.9152 42.721 65.7098 50.6452 61.095 56.7197Z" fill="white"/>
<path d="M60.3323 57.6646L52.3101 43.764L39.5859 65.4519C43.7935 66.0445 47.7725 65.575 51.529 64.0468C54.9739 62.6452 57.9073 60.5188 60.3323 57.6646Z" fill="white"/>
<path d="M27.2957 59.3898C24.9064 57.1095 22.9637 54.2366 21.7828 51.0916L46.6967 51.0946L38.3968 65.2409C34.1299 64.3317 30.4315 62.382 27.2957 59.3898Z" fill="white"/>
</g>
</g>
<defs>
<radialGradient id="paint0_radial_1_395" cx="0" cy="0" r="1" gradientUnits="userSpaceOnUse" gradientTransform="rotate(45) scale(121.622)">
<stop stop-color="#8737D7"/>
<stop offset="1" stop-color="#6B20A7"/>
</radialGradient>
<clipPath id="clip0_1_395">
<rect width="86" height="86" fill="white"/>
</clipPath>
<clipPath id="clip1_1_395">
<rect width="64" height="64" fill="white" transform="translate(11 11)"/>
</clipPath>
</defs>
</svg>
