{
	"lock": false,
	"tasks": {
		"check": "deno fmt --check **/*.ts && deno lint **/*.ts && deno check **/*.ts && deno check **/*.tsx",
		"start": "deno run -A --unstable main.ts"
	},
	"lint": {
		"rules": {
			"tags": [
				"recommended"
			]
		}
	},
	"fmt": {
		"useTabs": true,
		"lineWidth": 80,
		"indentWidth": 4,
		"semiColons": true,
		"singleQuote": true,
		"proseWrap": "preserve",
		"include": [
			"./"
		],
		"exclude": [
			"src/testdata/",
			"data/fixtures/**/*.ts",
			"node_modules"
		]
	},
	"compilerOptions": {
		"lib": [
			"deno.unstable",
			"dom"
		]
	},
	"exclude": [
		"**/node_modules/*"
	],
	"imports": {
		"$std/": "https://deno.land/std@0.208.0/",
		"dom/": "https://deno.land/x/deno_dom@v0.1.43/",
		"rss": "https://deno.land/x/rss@1.0.0/mod.ts",
		"rss/": "https://deno.land/x/rss@1.0.0/",
		"imagemagick": "https://deno.land/x/imagemagick_deno@0.0.14/mod.ts",
		"sift": "https://deno.land/x/sift@0.6.0/mod.ts"
	},
	"deploy": {
		"project": "8a4e1181-ed81-4f24-9f4c-0ff478ce9d77",
		"exclude": [
			"**/node_modules"
		],
		"include": [],
		"entrypoint": "main.ts"
	}
}
