{
  "formatVersion": 1,
  "database": {
    "version": 2,
    "identityHash": "047c792d17a5d59d7e9cb220ee2b3455",
    "entities": [
      {
        "tableName": "Student",
        "createSql": "CREATE TABLE IF NOT EXISTS `${TABLE_NAME}` (`StudentNumber` TEXT NOT NULL, `Name` TEXT, `Surname` TEXT, `Email` TEXT, `Password` TEXT, `Lecturer` INTEGER, `Assistant` INTEGER, PRIMARY KEY(`StudentNumber`))",
        "fields": [
          {
            "fieldPath": "StudentNumber",
            "columnName": "StudentNumber",
            "affinity": "TEXT",
            "notNull": true
          },
          {
            "fieldPath": "Name",
            "columnName": "Name",
            "affinity": "TEXT",
            "notNull": false
          },
          {
            "fieldPath": "Surname",
            "columnName": "Surname",
            "affinity": "TEXT",
            "notNull": false
          },
          {
            "fieldPath": "Email",
            "columnName": "Email",
            "affinity": "TEXT",
            "notNull": false
          },
          {
            "fieldPath": "Password",
            "columnName": "Password",
            "affinity": "TEXT",
            "notNull": false
          },
          {
            "fieldPath": "Lecturer",
            "columnName": "Lecturer",
            "affinity": "INTEGER",
            "notNull": false
          },
          {
            "fieldPath": "Assistant",
            "columnName": "Assistant",
            "affinity": "INTEGER",
            "notNull": false
          }
        ],
        "primaryKey": {
          "columnNames": [
            "StudentNumber"
          ],
          "autoGenerate": false
        },
        "indices": [],
        "foreignKeys": []
      },
      {
        "tableName": "Session",
        "createSql": "CREATE TABLE IF NOT EXISTS `${TABLE_NAME}` (`SessionID` TEXT NOT NULL, `ModuleCode` TEXT, `StartTime` TEXT, `EndTime` TEXT, `Date` TEXT, `Venue` TEXT, `Recurring` INTEGER, `Compulsory` TEXT, PRIMARY KEY(`SessionID`), FOREIGN KEY(`ModuleCode`) REFERENCES `Module`(`ModuleCode`) ON UPDATE NO ACTION ON DELETE NO ACTION )",
        "fields": [
          {
            "fieldPath": "SessionID",
            "columnName": "SessionID",
            "affinity": "TEXT",
            "notNull": true
          },
          {
            "fieldPath": "ModuleCode",
            "columnName": "ModuleCode",
            "affinity": "TEXT",
            "notNull": false
          },
          {
            "fieldPath": "StartTime",
            "columnName": "StartTime",
            "affinity": "TEXT",
            "notNull": false
          },
          {
            "fieldPath": "EndTime",
            "columnName": "EndTime",
            "affinity": "TEXT",
            "notNull": false
          },
          {
            "fieldPath": "Date",
            "columnName": "Date",
            "affinity": "TEXT",
            "notNull": false
          },
          {
            "fieldPath": "Venue",
            "columnName": "Venue",
            "affinity": "TEXT",
            "notNull": false
          },
          {
            "fieldPath": "Recurring",
            "columnName": "Recurring",
            "affinity": "INTEGER",
            "notNull": false
          },
          {
            "fieldPath": "Compulsory",
            "columnName": "Compulsory",
            "affinity": "TEXT",
            "notNull": false
          }
        ],
        "primaryKey": {
          "columnNames": [
            "SessionID"
          ],
          "autoGenerate": false
        },
        "indices": [],
        "foreignKeys": [
          {
            "table": "Module",
            "onDelete": "NO ACTION",
            "onUpdate": "NO ACTION",
            "columns": [
              "ModuleCode"
            ],
            "referencedColumns": [
              "ModuleCode"
            ]
          }
        ]
      },
      {
        "tableName": "Module",
        "createSql": "CREATE TABLE IF NOT EXISTS `${TABLE_NAME}` (`ModuleCode` TEXT NOT NULL, `ModuleName` TEXT, `ModuleDescription` TEXT, `ModuleFaculty` TEXT, PRIMARY KEY(`ModuleCode`))",
        "fields": [
          {
            "fieldPath": "ModuleCode",
            "columnName": "ModuleCode",
            "affinity": "TEXT",
            "notNull": true
          },
          {
            "fieldPath": "ModuleName",
            "columnName": "ModuleName",
            "affinity": "TEXT",
            "notNull": false
          },
          {
            "fieldPath": "ModuleDescription",
            "columnName": "ModuleDescription",
            "affinity": "TEXT",
            "notNull": false
          },
          {
            "fieldPath": "ModuleFaculty",
            "columnName": "ModuleFaculty",
            "affinity": "TEXT",
            "notNull": false
          }
        ],
        "primaryKey": {
          "columnNames": [
            "ModuleCode"
          ],
          "autoGenerate": false
        },
        "indices": [],
        "foreignKeys": []
      },
      {
        "tableName": "student_session_join",
        "createSql": "CREATE TABLE IF NOT EXISTS `${TABLE_NAME}` (`sNum` TEXT NOT NULL, `sesID` TEXT NOT NULL, PRIMARY KEY(`sNum`, `sesID`), FOREIGN KEY(`sNum`) REFERENCES `Student`(`StudentNumber`) ON UPDATE NO ACTION ON DELETE NO ACTION , FOREIGN KEY(`sesID`) REFERENCES `Session`(`SessionID`) ON UPDATE NO ACTION ON DELETE NO ACTION )",
        "fields": [
          {
            "fieldPath": "sNum",
            "columnName": "sNum",
            "affinity": "TEXT",
            "notNull": true
          },
          {
            "fieldPath": "sesID",
            "columnName": "sesID",
            "affinity": "TEXT",
            "notNull": true
          }
        ],
        "primaryKey": {
          "columnNames": [
            "sNum",
            "sesID"
          ],
          "autoGenerate": false
        },
        "indices": [],
        "foreignKeys": [
          {
            "table": "Student",
            "onDelete": "NO ACTION",
            "onUpdate": "NO ACTION",
            "columns": [
              "sNum"
            ],
            "referencedColumns": [
              "StudentNumber"
            ]
          },
          {
            "table": "Session",
            "onDelete": "NO ACTION",
            "onUpdate": "NO ACTION",
            "columns": [
              "sesID"
            ],
            "referencedColumns": [
              "SessionID"
            ]
          }
        ]
      }
    ],
    "setupQueries": [
      "CREATE TABLE IF NOT EXISTS room_master_table (id INTEGER PRIMARY KEY,identity_hash TEXT)",
      "INSERT OR REPLACE INTO room_master_table (id,identity_hash) VALUES(42, \"047c792d17a5d59d7e9cb220ee2b3455\")"
    ]
  }
}