module se02.com

go 1.15

require (
	github.com/bmizerany/pat v0.0.0-20170815010413-6226ea591a40
	github.com/cockroachdb/apd v1.1.0 // indirect
	github.com/gofrs/uuid v4.0.0+incompatible // indirect
	github.com/golangcollege/sessions v1.2.0
	github.com/jackc/fake v0.0.0-20150926172116-812a484cc733 // indirect
	github.com/jackc/pgx v3.6.2+incompatible
	github.com/justinas/alice v1.2.0
	github.com/lib/pq v1.9.0 // indirect
	github.com/pkg/errors v0.9.1
	github.com/shopspring/decimal v1.2.0 // indirect
	golang.org/x/crypto v0.0.0-20201221181555-eec23a3978ad // indirect
	golang.org/x/text v0.3.4 // indirect
)
