<svg width="28" height="28" viewBox="0 0 28 28" fill="none" xmlns="http://www.w3.org/2000/svg">
<path d="M22 5H21V4C21 3.45 20.55 3 20 3C19.45 3 19 3.45 19 4V5H9V4C9 3.45 8.55 3 8 3C7.45 3 7 3.45 7 4V5H6C4.9 5 4 5.9 4 7V23C4 24.1 4.9 25 6 25H22C23.1 25 24 24.1 24 23V7C24 5.9 23.1 5 22 5ZM21 23H7C6.45 23 6 22.55 6 22V10H22V22C22 22.55 21.55 23 21 23Z" fill="black"/>
</svg>
