<svg width="512" height="512" viewBox="0 0 512 512" fill="none" xmlns="http://www.w3.org/2000/svg">
<path d="M416 284.936H96V433.032C96 440.096 100.632 446.328 107.4 448.36C139.552 458 229.968 485.128 251.4 491.56C254.4 492.456 257.6 492.456 260.6 491.56C282.032 485.128 372.448 458 404.6 448.36C411.368 446.328 416 440.096 416 433.032C416 395.944 416 284.936 416 284.936Z" fill="url(#paint0_linear_305_2)"/>
<path d="M416 284.936H256C256 284.936 254.448 492.232 256 492.232C257.552 492.232 259.096 492.008 260.6 491.56C282.032 485.128 372.448 458 404.6 448.36C411.368 446.328 416 440.096 416 433.032C416 395.944 416 284.936 416 284.936Z" fill="url(#paint1_linear_305_2)"/>
<path d="M256 336.848L96.0001 284.936C96.0001 284.936 67.9441 326.536 55.4001 345.128C53.9921 347.216 53.6481 349.832 54.4641 352.208C55.2881 354.584 57.1681 356.432 59.5601 357.216C89.9521 367.088 179.92 396.32 203.52 403.984C206.904 405.088 210.616 403.816 212.616 400.864C223.344 385.032 256 336.848 256 336.848Z" fill="url(#paint2_linear_305_2)"/>
<path d="M416 284.936L256 336.848C256 336.848 288.656 385.032 299.384 400.864C301.384 403.816 305.096 405.088 308.48 403.984C332.08 396.32 422.048 367.088 452.44 357.216C454.832 356.432 456.712 354.584 457.536 352.208C458.352 349.832 458.008 347.216 456.6 345.128C444.056 326.536 416 284.936 416 284.936V284.936Z" fill="url(#paint3_linear_305_2)"/>
<path d="M217.272 175.888C215.272 172.952 211.568 171.68 208.184 172.784C184.6 180.44 94.6078 209.68 64.2158 219.56C61.8238 220.336 59.9358 222.184 59.1198 224.56C58.3038 226.936 58.6478 229.56 60.0558 231.64C71.6078 248.776 95.9998 284.936 95.9998 284.936L256 232.848C256 232.848 227.264 190.584 217.272 175.888V175.888Z" fill="url(#paint4_linear_305_2)"/>
<path d="M451.944 231.64C453.352 229.56 453.696 226.936 452.88 224.56C452.064 222.184 450.176 220.336 447.784 219.56C417.392 209.68 327.4 180.44 303.816 172.784C300.432 171.68 296.728 172.952 294.728 175.888C284.736 190.584 256 232.848 256 232.848L416 284.936C416 284.936 440.392 248.776 451.944 231.64Z" fill="url(#paint5_linear_305_2)"/>
<path d="M416 284.936L256 232.848L96 284.936L256 336.848L416 284.936Z" fill="url(#paint6_linear_305_2)"/>
<path d="M256 336.848V232.848L96 284.936L256 336.848Z" fill="url(#paint7_linear_305_2)"/>
<path d="M223.856 255.824C220.528 253.648 217.528 251.32 214.864 248.88C211.616 245.896 206.552 246.112 203.56 249.368C200.576 252.616 200.792 257.68 204.048 260.664C207.32 263.672 211.008 266.536 215.104 269.216C218.8 271.632 223.76 270.592 226.176 266.896C228.592 263.2 227.552 258.24 223.856 255.824V255.824Z" fill="black"/>
<path d="M198.928 231.248C196.552 228.024 194.544 224.784 192.896 221.544C190.896 217.608 186.072 216.04 182.136 218.04C178.2 220.04 176.632 224.864 178.632 228.8C180.664 232.784 183.128 236.776 186.048 240.736C188.664 244.288 193.672 245.048 197.232 242.432C200.784 239.808 201.544 234.8 198.928 231.248Z" fill="black"/>
<path d="M187.232 198.6C187.312 195.376 187.784 192.248 188.648 189.248C189.864 185.008 187.408 180.568 183.16 179.352C178.92 178.136 174.48 180.592 173.264 184.84C172.04 189.128 171.352 193.6 171.232 198.2C171.128 202.616 174.616 206.288 179.032 206.392C183.448 206.504 187.12 203.016 187.232 198.6Z" fill="black"/>
<path d="M199.536 171.88C201.592 169.976 203.896 168.216 206.416 166.624C210.152 164.264 211.272 159.32 208.92 155.592C206.56 151.856 201.616 150.736 197.88 153.088C194.496 155.224 191.424 157.584 188.664 160.144C185.424 163.144 185.232 168.208 188.232 171.448C191.232 174.688 196.296 174.88 199.536 171.88Z" fill="black"/>
<path d="M229.288 158.08C233.312 157.336 237.576 156.856 242.072 156.672C246.488 156.48 249.912 152.744 249.728 148.336C249.544 143.928 245.808 140.496 241.392 140.68C236.112 140.904 231.104 141.472 226.376 142.344C222.04 143.152 219.16 147.328 219.968 151.664C220.768 156.008 224.944 158.88 229.288 158.08V158.08Z" fill="black"/>
<path d="M270.984 157.608C277.808 157.688 284.16 157.448 290.056 156.928C294.456 156.536 297.712 152.648 297.32 148.248C296.928 143.856 293.04 140.6 288.64 140.992C283.24 141.464 277.424 141.688 271.168 141.608C266.752 141.56 263.128 145.104 263.08 149.512C263.024 153.928 266.568 157.56 270.984 157.608Z" fill="black"/>
<path d="M316.352 152.024C324.272 149.6 330.96 146.496 336.56 142.936C340.28 140.56 341.384 135.616 339.008 131.888C336.64 128.168 331.688 127.064 327.96 129.44C323.456 132.304 318.056 134.768 311.672 136.72C307.456 138.016 305.072 142.488 306.368 146.712C307.656 150.936 312.136 153.312 316.352 152.024V152.024Z" fill="black"/>
<path d="M357.072 120.544C360.848 112.736 362.297 104.48 361.929 96.5201C361.721 92.1041 357.968 88.6961 353.56 88.9041C349.152 89.1121 345.737 92.8561 345.945 97.2641C346.201 102.672 345.225 108.28 342.665 113.584C340.745 117.56 342.409 122.352 346.385 124.272C350.361 126.192 355.152 124.52 357.072 120.544V120.544Z" fill="black"/>
<path d="M351.976 68.232C346.144 60.352 338.232 54.864 329.608 53.096C325.28 52.216 321.048 55 320.16 59.328C319.28 63.656 322.072 67.888 326.392 68.776C331.368 69.792 335.752 73.208 339.12 77.76C341.752 81.304 346.768 82.048 350.312 79.424C353.864 76.792 354.608 71.776 351.976 68.232V68.232Z" fill="black"/>
<path d="M247.464 54.6479C256.12 5.63188 331.136 8.79988 287.464 54.6479H247.464Z" fill="url(#paint8_linear_305_2)"/>
<path d="M247.464 67.064C256.12 116.072 331.136 112.912 287.464 67.064H247.464Z" fill="url(#paint9_linear_305_2)"/>
<path d="M246.744 68.9358H300.312C304.728 68.9358 308.312 65.3518 308.312 60.9358C308.312 56.5198 304.728 52.9358 300.312 52.9358H246.744C242.336 52.9358 238.744 56.5198 238.744 60.9358C238.744 65.3518 242.336 68.9358 246.744 68.9358V68.9358Z" fill="url(#paint10_linear_305_2)"/>
<defs>
<linearGradient id="paint0_linear_305_2" x1="96" y1="388.584" x2="416" y2="388.584" gradientUnits="userSpaceOnUse">
<stop stop-color="#CADCF0"/>
<stop offset="1" stop-color="#A4BBDB"/>
</linearGradient>
<linearGradient id="paint1_linear_305_2" x1="255.312" y1="388.584" x2="416" y2="388.584" gradientUnits="userSpaceOnUse">
<stop stop-color="#A4BBDB"/>
<stop offset="1" stop-color="#8DA3BE"/>
</linearGradient>
<linearGradient id="paint2_linear_305_2" x1="97.0641" y1="284.872" x2="119.426" y2="432.819" gradientUnits="userSpaceOnUse">
<stop stop-color="#E9F3FC"/>
<stop offset="1" stop-color="#CADCF0"/>
</linearGradient>
<linearGradient id="paint3_linear_305_2" x1="256.648" y1="336.304" x2="425.318" y2="433.311" gradientUnits="userSpaceOnUse">
<stop stop-color="#E9F3FC"/>
<stop offset="1" stop-color="#CADCF0"/>
</linearGradient>
<linearGradient id="paint4_linear_305_2" x1="75.0558" y1="253.888" x2="99.1921" y2="140.109" gradientUnits="userSpaceOnUse">
<stop stop-color="#E9F3FC"/>
<stop offset="1" stop-color="#CADCF0"/>
</linearGradient>
<linearGradient id="paint5_linear_305_2" x1="298.832" y1="170.856" x2="307.463" y2="311.294" gradientUnits="userSpaceOnUse">
<stop stop-color="#E9F3FC"/>
<stop offset="1" stop-color="#CADCF0"/>
</linearGradient>
<linearGradient id="paint6_linear_305_2" x1="96" y1="284.848" x2="416" y2="284.848" gradientUnits="userSpaceOnUse">
<stop stop-color="#CADCF0"/>
<stop offset="1" stop-color="#A4BBDB"/>
</linearGradient>
<linearGradient id="paint7_linear_305_2" x1="272.384" y1="230.52" x2="275.832" y2="359.744" gradientUnits="userSpaceOnUse">
<stop stop-color="#A4BBDB"/>
<stop offset="1" stop-color="#8DA3BE"/>
</linearGradient>
<linearGradient id="paint8_linear_305_2" x1="247.464" y1="36.8559" x2="301.024" y2="36.8559" gradientUnits="userSpaceOnUse">
<stop stop-color="#E9F3FC"/>
<stop offset="1" stop-color="#CADCF0"/>
</linearGradient>
<linearGradient id="paint9_linear_305_2" x1="247.464" y1="84.856" x2="301.024" y2="84.856" gradientUnits="userSpaceOnUse">
<stop stop-color="#E9F3FC"/>
<stop offset="1" stop-color="#CADCF0"/>
</linearGradient>
<linearGradient id="paint10_linear_305_2" x1="167.928" y1="54.6478" x2="325.72" y2="240.832" gradientUnits="userSpaceOnUse">
<stop stop-color="#559AFF"/>
<stop offset="1" stop-color="#2E69EF"/>
</linearGradient>
</defs>
</svg>
