%YAML 1.1
%TAG !u! tag:unity3d.com,2011:
--- !u!114 &118696764
MonoBehaviour:
  m_ObjectHideFlags: 0
  m_CorrespondingSourceObject: {fileID: 0}
  m_PrefabInstance: {fileID: 0}
  m_PrefabAsset: {fileID: 0}
  m_GameObject: {fileID: 1467956141644924518}
  m_Enabled: 1
  m_EditorHideFlags: 0
  m_Script: {fileID: 11500000, guid: cddbafd5e2e8fa143800b25c3f00d4bb, type: 3}
  m_Name: 
  m_EditorClassIdentifier: 
  animator: {fileID: 281644260291783025}
  MaxHealth: 4
--- !u!1001 &6754813229968960954
PrefabInstance:
  m_ObjectHideFlags: 0
  serializedVersion: 2
  m_Modification:
    m_TransformParent: {fileID: 0}
    m_Modifications:
    - target: {fileID: 2117205320407328963, guid: d69deb1d066d0b4458f5eb86b6fc73d3,
        type: 3}
      propertyPath: m_Enabled
      value: 0
      objectReference: {fileID: 0}
    - target: {fileID: 2750820780617951181, guid: d69deb1d066d0b4458f5eb86b6fc73d3,
        type: 3}
      propertyPath: m_Offset.y
      value: -0.17
      objectReference: {fileID: 0}
    - target: {fileID: 2750820780617951181, guid: d69deb1d066d0b4458f5eb86b6fc73d3,
        type: 3}
      propertyPath: m_Size.y
      value: 0.8
      objectReference: {fileID: 0}
    - target: {fileID: 2750820780617951181, guid: d69deb1d066d0b4458f5eb86b6fc73d3,
        type: 3}
      propertyPath: m_Size.x
      value: 0.29
      objectReference: {fileID: 0}
    - target: {fileID: 2750820780617951181, guid: d69deb1d066d0b4458f5eb86b6fc73d3,
        type: 3}
      propertyPath: m_Offset.x
      value: -0.03
      objectReference: {fileID: 0}
    - target: {fileID: 3939781109272187250, guid: d69deb1d066d0b4458f5eb86b6fc73d3,
        type: 3}
      propertyPath: m_LocalPosition.x
      value: -5.67
      objectReference: {fileID: 0}
    - target: {fileID: 3939781109272187250, guid: d69deb1d066d0b4458f5eb86b6fc73d3,
        type: 3}
      propertyPath: m_LocalPosition.y
      value: -2.01
      objectReference: {fileID: 0}
    - target: {fileID: 3939781109272187250, guid: d69deb1d066d0b4458f5eb86b6fc73d3,
        type: 3}
      propertyPath: m_LocalPosition.z
      value: 0
      objectReference: {fileID: 0}
    - target: {fileID: 3939781109272187250, guid: d69deb1d066d0b4458f5eb86b6fc73d3,
        type: 3}
      propertyPath: m_LocalRotation.x
      value: 0
      objectReference: {fileID: 0}
    - target: {fileID: 3939781109272187250, guid: d69deb1d066d0b4458f5eb86b6fc73d3,
        type: 3}
      propertyPath: m_LocalRotation.y
      value: 0
      objectReference: {fileID: 0}
    - target: {fileID: 3939781109272187250, guid: d69deb1d066d0b4458f5eb86b6fc73d3,
        type: 3}
      propertyPath: m_LocalRotation.z
      value: 0
      objectReference: {fileID: 0}
    - target: {fileID: 3939781109272187250, guid: d69deb1d066d0b4458f5eb86b6fc73d3,
        type: 3}
      propertyPath: m_LocalRotation.w
      value: 1
      objectReference: {fileID: 0}
    - target: {fileID: 3939781109272187250, guid: d69deb1d066d0b4458f5eb86b6fc73d3,
        type: 3}
      propertyPath: m_RootOrder
      value: 0
      objectReference: {fileID: 0}
    - target: {fileID: 3939781109272187250, guid: d69deb1d066d0b4458f5eb86b6fc73d3,
        type: 3}
      propertyPath: m_LocalEulerAnglesHint.x
      value: 0
      objectReference: {fileID: 0}
    - target: {fileID: 3939781109272187250, guid: d69deb1d066d0b4458f5eb86b6fc73d3,
        type: 3}
      propertyPath: m_LocalEulerAnglesHint.y
      value: 0
      objectReference: {fileID: 0}
    - target: {fileID: 3939781109272187250, guid: d69deb1d066d0b4458f5eb86b6fc73d3,
        type: 3}
      propertyPath: m_LocalEulerAnglesHint.z
      value: 0
      objectReference: {fileID: 0}
    - target: {fileID: 3939781109272187250, guid: d69deb1d066d0b4458f5eb86b6fc73d3,
        type: 3}
      propertyPath: m_LocalScale.x
      value: 1.4
      objectReference: {fileID: 0}
    - target: {fileID: 3939781109272187250, guid: d69deb1d066d0b4458f5eb86b6fc73d3,
        type: 3}
      propertyPath: m_LocalScale.y
      value: 1.4
      objectReference: {fileID: 0}
    - target: {fileID: 5324047014738127836, guid: d69deb1d066d0b4458f5eb86b6fc73d3,
        type: 3}
      propertyPath: m_Name
      value: Enemy
      objectReference: {fileID: 0}
    - target: {fileID: 5324047014738127836, guid: d69deb1d066d0b4458f5eb86b6fc73d3,
        type: 3}
      propertyPath: m_TagString
      value: Enemy
      objectReference: {fileID: 0}
    - target: {fileID: 5324047014738127836, guid: d69deb1d066d0b4458f5eb86b6fc73d3,
        type: 3}
      propertyPath: m_Layer
      value: 8
      objectReference: {fileID: 0}
    - target: {fileID: 6471496300803645559, guid: d69deb1d066d0b4458f5eb86b6fc73d3,
        type: 3}
      propertyPath: m_Sprite
      value: 
      objectReference: {fileID: 4723107735738678597, guid: 77ba605bbd83f4448bc8683510c3155e,
        type: 3}
    - target: {fileID: 6797465856135693515, guid: d69deb1d066d0b4458f5eb86b6fc73d3,
        type: 3}
      propertyPath: m_Controller
      value: 
      objectReference: {fileID: 9100000, guid: 449703f7d11ea4c41b3174c8df7d38d8, type: 2}
    m_RemovedComponents: []
  m_SourcePrefab: {fileID: 100100000, guid: d69deb1d066d0b4458f5eb86b6fc73d3, type: 3}
--- !u!1 &1467956141644924518 stripped
GameObject:
  m_CorrespondingSourceObject: {fileID: 5324047014738127836, guid: d69deb1d066d0b4458f5eb86b6fc73d3,
    type: 3}
  m_PrefabInstance: {fileID: 6754813229968960954}
  m_PrefabAsset: {fileID: 0}
--- !u!95 &281644260291783025 stripped
Animator:
  m_CorrespondingSourceObject: {fileID: 6797465856135693515, guid: d69deb1d066d0b4458f5eb86b6fc73d3,
    type: 3}
  m_PrefabInstance: {fileID: 6754813229968960954}
  m_PrefabAsset: {fileID: 0}
