instant,cnt
13904,282
13905,278
13906,281
13907,275
13908,330
13909,737
13910,761
13911,540
13912,433
13913,284
13914,254
13915,146
13916,48
13917,21
13918,10
13919,6
13920,7
13921,40
13922,165
13923,465
13924,689
13925,320
13926,204
13927,221
13928,280
13929,278
13930,260
13931,276
13932,442
13933,797
13934,780
13935,618
13936,495
13937,327
13938,269
13939,152
13940,72
13941,30
13942,11
13943,6
13944,7
13945,42
13946,180
13947,462
13948,717
13949,332
13950,198
13951,209
13952,283
13953,247
13954,251
13955,258
13956,415
13957,730
13958,772
13959,601
13960,482
13961,293
13962,241
13963,157
13964,82
13965,50
13966,21
13967,7
13968,9
13969,33
13970,114
13971,351
13972,425
13973,350
13974,228
13975,227
13976,313
13977,374
13978,373
13979,350
13980,499
13981,718
13982,652
13983,472
13984,390
13985,306
13986,245
13987,191
13988,149
13989,88
13990,81
13991,36
13992,11
13993,11
13994,36
13995,71
13996,175
13997,279
13998,420
13999,500
14000,537
14001,527
14002,528
14003,530
14004,487
14005,458
14006,377
14007,281
14008,207
14009,239
14010,181
14011,109
14012,148
14013,119
14014,89
14015,40
14016,12
14017,12
14018,23
14019,60
14020,135
14021,273
14022,399
14023,514
14024,551
14025,547
14026,549
14027,543
14028,583
14029,457
14030,436
14031,399
14032,321
14033,282
14034,159
14035,114
14036,47
14037,25
14038,11
14039,5
14040,7
14041,50
14042,150
14043,483
14044,657
14045,314
14046,211
14047,229
14048,276
14049,274
14050,258
14051,260
14052,420
14053,846
14054,841
14055,631
14056,461
14057,319
14058,217
14059,125
14060,55
14061,23
14062,9
14063,6
14064,7
14065,34
14066,112
14067,482
14068,498
14069,318
14070,228
14071,226
14072,276
14073,274
14074,260
14075,275
14076,426
14077,779
14078,832
14079,620
14080,478
14081,351
14082,251
14083,142
14084,54
14085,27
14086,9
14087,6
14088,7
14089,45
14090,183
14091,497
14092,704
14093,320
14094,214
14095,227
14096,288
14097,277
14098,263
14099,276
14100,430
14101,835
14102,835
14103,613
14104,447
14105,353
14106,252
14107,155
14108,62
14109,30
14110,11
14111,6
14112,6
14113,41
14114,181
14115,500
14116,695
14117,336
14118,220
14119,236
14120,284
14121,281
14122,290
14123,270
14124,435
14125,832
14126,840
14127,599
14128,426
14129,358
14130,296
14131,161
14132,49
14133,35
14134,13
14135,7
14136,7
14137,29
14138,125
14139,381
14140,623
14141,333
14142,202
14143,223
14144,301
14145,298
14146,301
14147,306
14148,360
14149,568
14150,543
14151,377
14152,274
14153,182
14154,85
14155,83
14156,102
14157,109
14158,71
14159,30
14160,13
14161,15
14162,37
14163,62
14164,159
14165,292
14166,442
14167,522
14168,557
14169,585
14170,574
14171,564
14172,576
14173,537
14174,507
14175,413
14176,325
14177,294
14178,249
14179,204
14180,168
14181,117
14182,95
14183,44
14184,12
14185,12
14186,25
14187,51
14188,159
14189,249
14190,383
14191,471
14192,515
14193,388
14194,516
14195,568
14196,567
14197,341
14198,311
14199,343
14200,289
14201,177
14202,147
14203,109
14204,37
14205,22
14206,10
14207,5
14208,7
14209,37
14210,150
14211,478
14212,671
14213,321
14214,215
14215,234
14216,272
14217,274
14218,267
14219,271
14220,421
14221,815
14222,663
14223,452
14224,249
14225,240
14226,138
14227,108
14228,37
14229,20
14230,8
14231,5
14232,6
14233,32
14234,180
14235,492
14236,687
14237,326
14238,221
14239,244
14240,283
14241,305
14242,272
14243,295
14244,423
14245,850
14246,832
14247,408
14248,398
14249,313
14250,186
14251,119
14252,44
14253,26
14254,9
14255,5
14256,7
14257,41
14258,177
14259,487
14260,686
14261,325
14262,223
14263,237
14264,284
14265,283
14266,261
14267,280
14268,346
14269,810
14270,778
14271,471
14272,438
14273,326
14274,266
14275,131
14276,62
14277,30
14278,11
14279,7
14280,7
14281,41
14282,163
14283,478
14284,692
14285,325
14286,221
14287,232
14288,305
14289,285
14290,254
14291,279
14292,432
14293,815
14294,826
14295,597
14296,429
14297,335
14298,245
14299,165
14300,79
14301,46
14302,17
14303,7
14304,8
14305,42
14306,138
14307,413
14308,677
14309,381
14310,261
14311,274
14312,369
14313,368
14314,370
14315,368
14316,470
14317,746
14318,631
14319,470
14320,381
14321,266
14322,238
14323,195
14324,165
14325,106
14326,90
14327,35
14328,11
14329,11
14330,36
14331,56
14332,154
14333,253
14334,436
14335,490
14336,504
14337,549
14338,517
14339,537
14340,540
14341,408
14342,427
14343,332
14344,162
14345,241
14346,180
14347,177
14348,105
14349,129
14350,93
14351,39
14352,13
14353,10
14354,16
14355,62
14356,127
14357,254
14358,390
14359,509
14360,492
14361,497
14362,365
14363,350
14364,327
14365,272
14366,254
14367,248
14368,221
14369,225
14370,128
14371,108
14372,43
14373,20
14374,9
14375,5
14376,6
14377,38
14378,152
14379,464
14380,502
14381,340
14382,221
14383,234
14384,252
14385,274
14386,267
14387,272
14388,435
14389,836
14390,837
14391,564
14392,473
14393,316
14394,199
14395,128
14396,49
14397,22
14398,12
14399,5
14400,7
14401,44
14402,171
14403,489
14404,550
14405,332
14406,216
14407,233
14408,281
14409,277
14410,258
14411,265
14412,422
14413,842
14414,833
14415,625
14416,434
14417,326
14418,254
14419,150
14420,50
14421,26
14422,9
14423,6
14424,6
14425,39
14426,185
14427,494
14428,687
14429,321
14430,218
14431,242
14432,308
14433,318
14434,272
14435,279
14436,442
14437,832
14438,830
14439,615
14440,422
14441,336
14442,286
14443,158
14444,59
14445,30
14446,11
14447,6
14448,7
14449,42
14450,182
14451,495
14452,682
14453,326
14454,219
14455,226
14456,289
14457,283
14458,259
14459,280
14460,436
14461,828
14462,832
14463,623
14464,486
14465,333
14466,260
14467,158
14468,78
14469,38
14470,18
14471,24
14472,14
14473,41
14474,141
14475,389
14476,680
14477,354
14478,244
14479,245
14480,340
14481,334
14482,312
14483,315
14484,434
14485,655
14486,656
14487,487
14488,378
14489,291
14490,252
14491,197
14492,178
14493,100
14494,84
14495,35
14496,11
14497,12
14498,40
14499,61
14500,161
14501,270
14502,436
14503,486
14504,534
14505,485
14506,472
14507,465
14508,432
14509,316
14510,312
14511,291
14512,291
14513,126
14514,190
14515,190
14516,155
14517,148
14518,99
14519,43
14520,12
14521,11
14522,21
14523,53
14524,148
14525,233
14526,382
14527,485
14528,500
14529,518
14530,516
14531,512
14532,581
14533,429
14534,338
14535,250
14536,239
14537,275
14538,131
14539,109
14540,142
14541,128
14542,72
14543,25
14544,12
14545,13
14546,45
14547,111
14548,242
14549,259
14550,365
14551,424
14552,469
14553,472
14554,450
14555,452
14556,506
14557,490
14558,538
14559,377
14560,372
14561,328
14562,211
14563,121
14564,41
14565,19
14566,9
14567,4
14568,6
14569,43
14570,173
14571,385
14572,570
14573,314
14574,223
14575,221
14576,248
14577,281
14578,266
14579,269
14580,321
14581,585
14582,638
14583,560
14584,487
14585,334
14586,253
14587,165
14588,56
14589,20
14590,10
14591,6
14592,7
14593,33
14594,170
14595,487
14596,701
14597,307
14598,222
14599,218
14600,259
14601,240
14602,232
14603,245
14604,309
14605,767
14606,594
14607,586
14608,394
14609,324
14610,266
14611,152
14612,56
14613,22
14614,11
14615,7
14616,8
14617,35
14618,160
14619,465
14620,456
14621,199
14622,138
14623,152
14624,248
14625,247
14626,238
14627,244
14628,315
14629,511
14630,556
14631,514
14632,428
14633,288
14634,181
14635,136
14636,52
14637,41
14638,18
14639,7
14640,9
14641,37
14642,149
14643,388
14644,660
14645,352
14646,235
14647,258
14648,349
14649,345
14650,345
14651,357
14652,493
14653,688
14654,652
14655,476
14656,395
14657,295
14658,227
14659,176
14660,142
14661,82
14662,69
14663,34
14664,13
14665,14
14666,30
14667,60
14668,157
14669,287
14670,426
14671,506
14672,538
14673,506
14674,500
14675,312
14676,308
14677,307
14678,279
14679,209
14680,256
14681,207
14682,194
14683,185
14684,122
14685,98
14686,88
14687,39
14688,13
14689,15
14690,21
14691,55
14692,128
14693,258
14694,390
14695,507
14696,582
14697,631
14698,601
14699,600
14700,624
14701,535
14702,477
14703,403
14704,307
14705,255
14706,158
14707,111
14708,40
14709,18
14710,10
14711,5
14712,5
14713,32
14714,148
14715,513
14716,661
14717,314
14718,208
14719,227
14720,285
14721,278
14722,274
14723,287
14724,429
14725,833
14726,793
14727,591
14728,455
14729,261
14730,174
14731,115
14732,41
14733,19
14734,9
14735,4
14736,6
14737,33
14738,178
14739,529
14740,676
14741,323
14742,223
14743,241
14744,299
14745,296
14746,280
14747,291
14748,446
14749,859
14750,821
14751,577
14752,407
14753,273
14754,184
14755,116
14756,48
14757,26
14758,9
14759,6
14760,6
14761,35
14762,174
14763,526
14764,691
14765,338
14766,214
14767,244
14768,302
14769,298
14770,272
14771,286
14772,441
14773,827
14774,811
14775,585
14776,428
14777,306
14778,220
14779,127
14780,55
14781,26
14782,12
14783,7
14784,7
14785,33
14786,173
14787,501
14788,679
14789,338
14790,220
14791,243
14792,310
14793,321
14794,268
14795,288
14796,421
14797,844
14798,805
14799,587
14800,409
14801,306
14802,229
14803,150
14804,74
14805,46
14806,18
14807,8
14808,9
14809,33
14810,148
14811,386
14812,681
14813,346
14814,248
14815,276
14816,363
14817,365
14818,375
14819,362
14820,484
14821,730
14822,696
14823,498
14824,374
14825,305
14826,180
14827,197
14828,127
14829,109
14830,78
14831,33
14832,13
14833,16
14834,51
14835,65
14836,168
14837,303
14838,437
14839,556
14840,628
14841,625
14842,631
14843,608
14844,573
14845,531
14846,473
14847,425
14848,316
14849,252
14850,234
14851,189
14852,145
14853,112
14854,93
14855,44
14856,12
14857,12
14858,25
14859,45
14860,145
14861,254
14862,394
14863,519
14864,602
14865,614
14866,619
14867,595
14868,589
14869,473
14870,463
14871,373
14872,296
14873,273
14874,157
14875,107
14876,41
14877,25
14878,8
14879,6
14880,6
14881,34
14882,152
14883,512
14884,656
14885,333
14886,204
14887,222
14888,249
14889,249
14890,219
14891,226
14892,327
14893,704
14894,674
14895,478
14896,379
14897,124
14898,107
14899,96
14900,30
14901,11
14902,6
14903,5
14904,6
14905,35
14906,168
14907,345
14908,581
14909,351
14910,176
14911,212
14912,126
14913,237
14914,112
14915,127
14916,225
14917,329
14918,531
14919,361
14920,254
14921,207
14922,99
14923,105
14924,39
14925,15
14926,10
14927,5
14928,6
14929,35
14930,180
14931,528
14932,697
14933,329
14934,206
14935,230
14936,312
14937,299
14938,269
14939,296
14940,425
14941,787
14942,708
14943,548
14944,409
14945,250
14946,212
14947,112
14948,51
14949,30
14950,12
14951,8
14952,9
14953,33
14954,171
14955,472
14956,690
14957,330
14958,212
14959,235
14960,316
14961,305
14962,273
14963,289
14964,433
14965,814
14966,782
14967,555
14968,411
14969,286
14970,224
14971,151
14972,75
14973,46
14974,19
14975,8
14976,9
14977,33
14978,153
14979,424
14980,688
14981,353
14982,237
14983,270
14984,365
14985,364
14986,357
14987,365
14988,507
14989,712
14990,671
14991,490
14992,388
14993,277
14994,220
14995,184
14996,133
14997,79
14998,63
14999,28
15000,13
15001,17
15002,34
15003,61
15004,161
15005,290
15006,438
15007,523
15008,556
15009,547
15010,556
15011,543
15012,571
15013,510
15014,483
15015,407
15016,321
15017,287
15018,261
15019,216
15020,147
15021,74
15022,86
15023,40
15024,10
15025,10
15026,20
15027,79
15028,125
15029,242
15030,372
15031,476
15032,580
15033,617
15034,615
15035,617
15036,608
15037,482
15038,448
15039,343
15040,272
15041,195
15042,147
15043,103
15044,49
15045,23
15046,11
15047,4
15048,7
15049,33
15050,147
15051,455
15052,650
15053,325
15054,196
15055,231
15056,267
15057,280
15058,280
15059,295
15060,410
15061,672
15062,690
15063,511
15064,370
15065,232
15066,153
15067,76
15068,48
15069,24
15070,7
15071,4
15072,5
15073,33
15074,178
15075,419
15076,678
15077,329
15078,206
15079,235
15080,292
15081,277
15082,274
15083,287
15084,436
15085,831
15086,814
15087,582
15088,450
15089,304
15090,243
15091,167
15092,43
15093,21
15094,10
15095,5
15096,6
15097,35
15098,180
15099,508
15100,690
15101,329
15102,213
15103,226
15104,285
15105,285
15106,270
15107,294
15108,432
15109,848
15110,834
15111,618
15112,473
15113,352
15114,190
15115,122
15116,62
15117,27
15118,13
15119,7
15120,6
15121,34
15122,174
15123,485
15124,690
15125,328
15126,214
15127,233
15128,282
15129,283
15130,268
15131,287
15132,402
15133,605
15134,623
15135,591
15136,396
15137,134
15138,101
15139,91
15140,46
15141,44
15142,15
15143,9
15144,9
15145,32
15146,136
15147,361
15148,660
15149,355
15150,225
15151,276
15152,363
15153,368
15154,362
15155,365
15156,506
15157,721
15158,693
15159,406
15160,348
15161,229
15162,203
15163,191
15164,143
15165,88
15166,73
15167,30
15168,12
15169,13
15170,49
15171,71
15172,164
15173,305
15174,416
15175,508
15176,639
15177,648
15178,643
15179,639
15180,611
15181,499
15182,445
15183,356
15184,286
15185,240
15186,219
15187,189
15188,146
15189,111
15190,79
15191,38
15192,11
15193,11
15194,23
15195,90
15196,133
15197,238
15198,393
15199,513
15200,627
15201,625
15202,614
15203,635
15204,609
15205,507
15206,419
15207,261
15208,218
15209,188
15210,130
15211,96
15212,61
15213,19
15214,8
15215,7
15216,5
15217,34
15218,151
15219,419
15220,648
15221,325
15222,201
15223,233
15224,286
15225,280
15226,268
15227,271
15228,430
15229,505
15230,507
15231,491
15232,309
15233,232
15234,109
15235,104
15236,38
15237,16
15238,9
15239,4
15240,6
15241,31
15242,118
15243,351
15244,379
15245,191
15246,127
15247,134
15248,221
15249,223
15250,125
15251,132
15252,255
15253,313
15254,335
15255,259
15256,163
15257,109
15258,119
15259,107
15260,34
15261,15
15262,8
15263,5
15264,5
15265,36
15266,161
15267,379
15268,633
15269,325
15270,216
15271,217
15272,262
15273,254
15274,238
15275,242
15276,397
15277,770
15278,770
15279,595
15280,426
15281,288
15282,260
15283,158
15284,42
15285,16
15286,9
15287,6
15288,6
15289,41
15290,112
15291,420
15292,644
15293,321
15294,190
15295,222
15296,287
15297,277
15298,269
15299,297
15300,433
15301,830
15302,791
15303,578
15304,409
15305,302
15306,289
15307,160
15308,78
15309,46
15310,18
15311,8
15312,9
15313,33
15314,150
15315,424
15316,685
15317,367
15318,252
15319,268
15320,370
15321,362
15322,382
15323,370
15324,490
15325,764
15326,668
15327,488
15328,360
15329,278
15330,222
15331,180
15332,116
15333,87
15334,76
15335,29
15336,13
15337,15
15338,31
15339,64
15340,173
15341,292
15342,415
15343,517
15344,594
15345,587
15346,582
15347,599
15348,593
15349,479
15350,418
15351,344
15352,262
15353,167
15354,165
15355,141
15356,93
15357,72
15358,62
15359,36
15360,9
15361,10
15362,24
15363,127
15364,158
15365,167
15366,373
15367,406
15368,417
15369,443
15370,437
15371,194
15372,168
15373,180
15374,182
15375,264
15376,169
15377,122
15378,103
15379,48
15380,59
15381,34
15382,30
15383,20
15384,7
15385,8
15386,51
15387,60
15388,135
15389,221
15390,307
15391,366
15392,410
15393,423
15394,413
15395,207
15396,206
15397,340
15398,332
15399,274
15400,136
15401,136
15402,90
15403,55
15404,19
15405,8
15406,4
15407,4
15408,5
15409,30
15410,106
15411,392
15412,628
15413,310
15414,176
15415,213
15416,240
15417,236
15418,228
15419,231
15420,337
15421,694
15422,679
15423,463
15424,344
15425,215
15426,147
15427,101
15428,33
15429,15
15430,7
15431,4
15432,5
15433,32
15434,159
15435,472
15436,685
15437,329
15438,206
15439,241
15440,271
15441,267
15442,273
15443,281
15444,439
15445,713
15446,718
15447,508
15448,391
15449,247
15450,159
15451,76
15452,51
15453,19
15454,8
15455,4
15456,5
15457,30
15458,114
15459,354
15460,626
15461,315
15462,204
15463,235
15464,279
15465,270
15466,264
15467,272
15468,414
15469,719
15470,588
15471,396
15472,267
15473,205
15474,154
15475,128
15476,53
15477,38
15478,14
15479,7
15480,6
15481,30
15482,92
15483,386
15484,640
15485,340
15486,226
15487,265
15488,341
15489,348
15490,342
15491,351
15492,311
15493,594
15494,577
15495,387
15496,255
15497,209
15498,146
15499,95
15500,68
15501,59
15502,46
15503,22
15504,6
15505,6
15506,28
15507,52
15508,146
15509,248
15510,312
15511,406
15512,430
15513,478
15514,557
15515,583
15516,536
15517,347
15518,329
15519,276
15520,165
15521,149
15522,153
15523,111
15524,88
15525,68
15526,57
15527,31
15528,9
15529,8
15530,19
15531,72
15532,135
15533,241
15534,378
15535,476
15536,581
15537,608
15538,605
15539,588
15540,596
15541,518
15542,449
15543,350
15544,282
15545,208
15546,161
15547,109
15548,37
15549,16
15550,10
15551,4
15552,6
15553,30
15554,146
15555,488
15556,667
15557,216
15558,206
15559,217
15560,148
15561,201
15562,190
15563,223
15564,360
15565,711
15566,437
15567,286
15568,357
15569,242
15570,153
15571,75
15572,40
15573,16
15574,7
15575,4
15576,4
15577,32
15578,170
15579,406
15580,661
15581,334
15582,194
15583,234
15584,261
15585,268
15586,257
15587,264
15588,402
15589,730
15590,712
15591,484
15592,293
15593,214
15594,144
15595,71
15596,21
15597,10
15598,5
15599,5
15600,6
15601,31
15602,110
15603,397
15604,629
15605,316
15606,186
15607,232
15608,262
15609,262
15610,262
15611,264
15612,405
15613,703
15614,713
15615,483
15616,348
15617,216
15618,144
15619,71
15620,45
15621,22
15622,9
15623,4
15624,4
15625,33
15626,173
15627,411
15628,642
15629,330
15630,194
15631,231
15632,279
15633,287
15634,270
15635,261
15636,430
15637,681
15638,701
15639,494
15640,394
15641,251
15642,176
15643,142
15644,70
15645,44
15646,17
15647,8
15648,9
15649,32
15650,95
15651,285
15652,641
15653,361
15654,215
15655,235
15656,293
15657,262
15658,361
15659,309
15660,272
15661,404
15662,534
15663,377
15664,354
15665,233
15666,214
15667,137
15668,113
15669,95
15670,60
15671,26
15672,10
15673,9
15674,37
15675,83
15676,170
15677,314
15678,408
15679,513
15680,597
15681,601
15682,613
15683,609
15684,548
15685,492
15686,434
15687,346
15688,265
15689,170
15690,169
15691,140
15692,93
15693,71
15694,58
15695,37
15696,8
15697,10
15698,28
15699,79
15700,132
15701,251
15702,367
15703,494
15704,578
15705,586
15706,595
15707,579
15708,550
15709,477
15710,431
15711,340
15712,265
15713,150
15714,122
15715,67
15716,33
15717,19
15718,6
15719,4
15720,5
15721,30
15722,105
15723,386
15724,655
15725,312
15726,198
15727,230
15728,282
15729,282
15730,259
15731,286
15732,446
15733,799
15734,672
15735,505
15736,340
15737,221
15738,126
15739,73
15740,34
15741,18
15742,6
15743,8
15744,6
15745,34
15746,139
15747,416
15748,653
15749,333
15750,204
15751,240
15752,277
15753,287
15754,269
15755,279
15756,423
15757,838
15758,791
15759,570
15760,405
15761,272
15762,184
15763,115
15764,44
15765,20
15766,8
15767,5
15768,6
15769,36
15770,179
15771,416
15772,657
15773,335
15774,206
15775,223
15776,273
15777,278
15778,267
15779,286
15780,447
15781,834
15782,824
15783,509
15784,391
15785,275
15786,241
15787,124
15788,59
15789,25
15790,11
15791,5
15792,5
15793,33
15794,159
15795,409
15796,663
15797,328
15798,180
15799,178
15800,241
15801,238
15802,240
15803,253
15804,348
15805,723
15806,539
15807,468
15808,264
15809,216
15810,181
15811,147
15812,72
15813,43
15814,17
15815,8
15816,9
15817,32
15818,137
15819,375
15820,649
15821,352
15822,227
15823,255
15824,261
15825,273
15826,331
15827,343
15828,429
15829,664
15830,647
15831,417
15832,285
15833,240
15834,179
15835,190
15836,118
15837,108
15838,65
15839,30
15840,12
15841,12
15842,34
15843,75
15844,161
15845,291
15846,406
15847,507
15848,613
15849,647
15850,616
15851,568
15852,521
15853,468
15854,436
15855,346
15856,286
15857,222
15858,204
15859,175
15860,115
15861,85
15862,84
15863,38
15864,11
15865,12
15866,21
15867,54
15868,122
15869,223
15870,381
15871,478
15872,537
15873,540
15874,538
15875,530
15876,391
15877,217
15878,183
15879,170
15880,126
15881,79
15882,82
15883,43
15884,26
15885,102
15886,103
15887,95
15888,111
15889,193
15890,234
15891,468
15892,179
15893,154
15894,111
15895,50
15896,22
15897,10
15898,4
15899,4
15900,5
15901,25
15902,98
15903,301
15904,604
15905,294
15906,144
15907,156
15908,197
15909,217
15910,204
15911,204
15912,253
15913,541
15914,539
15915,378
15916,234
15917,206
15918,131
15919,65
15920,28
15921,13
15922,5
15923,4
15924,5
15925,28
15926,100
15927,345
15928,592
15929,254
15930,165
15931,165
15932,201
15933,210
15934,202
15935,201
15936,255
15937,410
15938,535
15939,377
15940,225
15941,197
15942,137
15943,87
15944,39
15945,17
15946,10
15947,5
15948,6
15949,24
15950,93
15951,294
15952,587
15953,318
15954,212
15955,237
15956,272
15957,260
15958,240
15959,233
15960,272
15961,537
15962,521
15963,364
15964,193
15965,177
15966,128
15967,86
15968,70
15969,52
15970,43
15971,24
15972,6
15973,5
15974,33
15975,58
15976,127
15977,216
15978,284
15979,308
15980,321
15981,326
15982,322
15983,319
15984,299
15985,268
15986,250
15987,212
15988,135
15989,131
15990,120
15991,88
15992,69
15993,63
15994,53
15995,35
15996,11
15997,10
15998,29
15999,39
16000,93
16001,185
16002,255
16003,361
16004,378
16005,400
16006,396
16007,394
16008,382
16009,289
16010,260
16011,202
16012,99
16013,73
16014,79
16015,52
16016,20
16017,10
16018,5
16019,3
16020,4
16021,22
16022,95
16023,299
16024,510
16025,272
16026,139
16027,158
16028,182
16029,183
16030,196
16031,196
16032,239
16033,465
16034,466
16035,303
16036,201
16037,142
16038,98
16039,52
16040,19
16041,8
16042,3
16043,2
16044,3
16045,20
16046,100
16047,289
16048,516
16049,256
16050,144
16051,168
16052,193
16053,193
16054,194
16055,174
16056,241
16057,403
16058,405
16059,263
16060,186
16061,138
16062,100
16063,56
16064,21
16065,8
16066,5
16067,3
16068,3
16069,23
16070,95
16071,310
16072,521
16073,258
16074,139
16075,149
16076,160
16077,156
16078,145
16079,152
16080,207
16081,384
16082,384
16083,254
16084,199
16085,154
16086,86
16087,45
16088,18
16089,10
16090,5
16091,3
16092,24
16093,104
16094,312
16095,565
16096,289
16097,182
16098,212
16099,255
16100,311
16101,307
16102,304
16103,324
16104,569
16105,570
16106,386
16107,227
16108,190
16109,121
16110,79
16111,40
16112,18
16113,7
16114,6
16115,6
16116,24
16117,88
16118,270
16119,585
16120,315
16121,190
16122,228
16123,283
16124,285
16125,272
16126,299
16127,312
16128,559
16129,556
16130,298
16131,196
16132,181
16133,140
16134,84
16135,59
16136,52
16137,49
16138,26
16139,8
16140,7
16141,23
16142,43
16143,141
16144,235
16145,308
16146,370
16147,572
16148,611
16149,616
16150,596
16151,569
16152,445
16153,322
16154,286
16155,188
16156,143
16157,146
16158,90
16159,59
16160,58
16161,48
16162,33
16163,9
16164,7
16165,21
16166,44
16167,106
16168,217
16169,337
16170,440
16171,562
16172,576
16173,619
16174,578
16175,542
16176,483
16177,396
16178,336
16179,185
16180,143
16181,116
16182,64
16183,60
16184,46
16185,39
16186,19
16187,11
16188,9
16189,54
16190,86
16191,150
16192,244
16193,349
16194,390
16195,397
16196,395
16197,392
16198,388
16199,472
16200,536
16201,429
16202,342
16203,290
16204,145
16205,159
16206,103
16207,31
16208,12
16209,4
16210,4
16211,5
16212,24
16213,82
16214,286
16215,344
16216,149
16217,100
16218,130
16219,158
16220,171
16221,197
16222,194
16223,247
16224,440
16225,468
16226,276
16227,185
16228,134
16229,83
16230,45
16231,20
16232,9
16233,5
16234,3
16235,3
16236,21
16237,100
16238,299
16239,543
16240,270
16241,151
16242,153
16243,190
16244,191
16245,183
16246,180
16247,242
16248,435
16249,438
16250,276
16251,209
16252,187
16253,124
16254,55
16255,26
16256,11
16257,5
16258,3
16259,4
16260,23
16261,97
16262,310
16263,508
16264,286
16265,148
16266,158
16267,195
16268,214
16269,201
16270,191
16271,226
16272,459
16273,456
16274,302
16275,218
16276,173
16277,117
16278,78
16279,38
16280,17
16281,10
16282,6
16283,6
16284,25
16285,89
16286,285
16287,552
16288,318
16289,182
16290,229
16291,259
16292,278
16293,312
16294,264
16295,326
16296,465
16297,458
16298,310
16299,199
16300,185
16301,122
16302,85
16303,67
16304,55
16305,44
16306,25
16307,7
16308,6
16309,21
16310,44
16311,110
16312,227
16313,284
16314,362
16315,387
16316,423
16317,424
16318,429
16319,389
16320,315
16321,289
16322,198
16323,132
16324,115
16325,112
16326,78
16327,63
16328,59
16329,47
16330,29
16331,7
16332,9
16333,22
16334,36
16335,87
16336,169
16337,240
16338,354
16339,380
16340,378
16341,380
16342,402
16343,359
16344,301
16345,251
16346,206
16347,131
16348,115
16349,93
16350,53
16351,22
16352,10
16353,5
16354,4
16355,5
16356,28
16357,110
16358,342
16359,565
16360,281
16361,138
16362,170
16363,197
16364,236
16365,225
16366,219
16367,255
16368,573
16369,564
16370,382
16371,222
16372,196
16373,115
16374,64
16375,22
16376,9
16377,3
16378,4
16379,5
16380,27
16381,102
16382,363
16383,611
16384,299
16385,172
16386,184
16387,213
16388,227
16389,212
16390,220
16391,258
16392,515
16393,548
16394,372
16395,217
16396,194
16397,130
16398,56
16399,21
16400,10
16401,3
16402,3
16403,4
16404,25
16405,99
16406,288
16407,526
16408,292
16409,167
16410,178
16411,238
16412,271
16413,271
16414,265
16415,303
16416,554
16417,564
16418,375
16419,219
16420,198
16421,128
16422,71
16423,47
16424,37
16425,29
16426,23
16427,10
16428,10
16429,33
16430,47
16431,114
16432,195
16433,303
16434,398
16435,424
16436,461
16437,445
16438,440
16439,430
16440,358
16441,321
16442,255
16443,142
16444,125
16445,122
16446,86
16447,38
16448,15
16449,10
16450,4
16451,4
16452,22
16453,86
16454,267
16455,495
16456,282
16457,169
16458,218
16459,282
16460,284
16461,396
16462,388
16463,418
16464,662
16465,558
16466,391
16467,299
16468,222
16469,152
16470,106
16471,78
16472,50
16473,39
16474,23
16475,5
16476,5
16477,26
16478,50
16479,122
16480,157
16481,202
16482,231
16483,238
16484,316
16485,261
16486,217
16487,208
16488,173
16489,167
16490,143
16491,94
16492,78
16493,83
16494,80
16495,58
16496,54
16497,44
16498,34
16499,10
16500,7
16501,36
16502,42
16503,88
16504,120
16505,196
16506,216
16507,241
16508,239
16509,273
16510,275
16511,266
16512,175
16513,153
16514,144
16515,89
16516,92
16517,119
16518,45
16519,19
16520,8
16521,3
16522,2
16523,3
16524,20
16525,96
16526,294
16527,527
16528,273
16529,153
16530,222
16531,255
16532,256
16533,255
16534,253
16535,303
16536,595
16537,486
16538,349
16539,215
16540,193
16541,113
16542,56
16543,20
16544,10
16545,4
16546,2
16547,4
16548,23
16549,92
16550,266
16551,364
16552,286
16553,111
16554,93
16555,102
16556,96
16557,102
16558,135
16559,164
16560,295
16561,272
16562,232
16563,175
16564,114
16565,82
16566,47
16567,20
16568,8
16569,4
16570,3
16571,3
16572,25
16573,97
16574,299
16575,534
16576,268
16577,153
16578,167
16579,176
16580,190
16581,181
16582,206
16583,253
16584,471
16585,399
16586,304
16587,214
16588,166
16589,104
16590,54
16591,24
16592,9
16593,3
16594,3
16595,20
16596,97
16597,286
16598,503
16599,264
16600,135
16601,204
16602,199
16603,245
16604,189
16605,186
16606,245
16607,465
16608,428
16609,258
16610,197
16611,120
16612,112
16613,87
16614,28
16615,11
16616,10
16617,3
16618,3
16619,19
16620,79
16621,263
16622,467
16623,265
16624,163
16625,192
16626,254
16627,254
16628,243
16629,255
16630,280
16631,466
16632,491
16633,303
16634,193
16635,170
16636,128
16637,76
16638,74
16639,70
16640,47
16641,25
16642,9
16643,8
16644,23
16645,41
16646,110
16647,143
16648,204
16649,253
16650,253
16651,312
16652,341
16653,372
16654,345
16655,243
16656,271
16657,193
16658,136
16659,103
16660,98
16661,76
16662,63
16663,57
16664,52
16665,30
16666,9
16667,9
16668,25
16669,32
16670,82
16671,129
16672,186
16673,228
16674,250
16675,398
16676,418
16677,431
16678,414
16679,183
16680,330
16681,265
16682,184
16683,132
16684,115
16685,57
16686,28
16687,15
16688,8
16689,4
16690,5
16691,25
16692,100
16693,360
16694,632
16695,307
16696,177
16697,206
16698,259
16699,265
16700,274
16701,273
16702,436
16703,690
16704,663
16705,489
16706,288
16707,206
16708,130
16709,66
16710,28
16711,16
16712,6
16713,4
16714,4
16715,31
16716,103
16717,409
16718,625
16719,322
16720,170
16721,209
16722,259
16723,246
16724,250
16725,264
16726,404
16727,705
16728,695
16729,473
16730,342
16731,219
16732,155
16733,98
16734,41
16735,20
16736,9
16737,4
16738,6
16739,35
16740,87
16741,372
16742,625
16743,310
16744,185
16745,192
16746,241
16747,251
16748,255
16749,268
16750,316
16751,585
16752,577
16753,380
16754,210
16755,161
16756,107
16757,55
16758,24
16759,10
16760,5
16761,3
16762,2
16763,20
16764,93
16765,294
16766,512
16767,266
16768,120
16769,137
16770,185
16771,192
16772,181
16773,190
16774,235
16775,409
16776,340
16777,228
16778,150
16779,115
16780,89
16781,67
16782,27
16783,10
16784,10
16785,4
16786,3
16787,23
16788,82
16789,238
16790,444
16791,286
16792,159
16793,162
16794,187
16795,195
16796,183
16797,180
16798,227
16799,508
16800,473
16801,347
16802,178
16803,166
16804,110
16805,67
16806,57
16807,52
16808,48
16809,23
16810,7
16811,7
16812,36
16813,81
16814,160
16815,211
16816,297
16817,326
16818,347
16819,343
16820,335
16821,392
16822,383
16823,294
16824,297
16825,258
16826,132
16827,114
16828,122
16829,108
16830,77
16831,66
16832,50
16833,25
16834,9
16835,8
16836,22
16837,117
16838,137
16839,195
16840,290
16841,330
16842,345
16843,318
16844,342
16845,132
16846,133
16847,144
16848,164
16849,167
16850,108
16851,108
16852,74
16853,41
16854,14
16855,9
16856,7
16857,5
16858,5
16859,28
16860,97
16861,357
16862,599
16863,292
16864,166
16865,192
16866,187
16867,184
16868,192
16869,207
16870,312
16871,499
16872,453
16873,462
16874,271
16875,195
16876,136
16877,66
16878,30
16879,17
16880,7
16881,3
16882,4
16883,21
16884,106
16885,345
16886,558
16887,294
16888,150
16889,160
16890,169
16891,197
16892,189
16893,187
16894,244
16895,403
16896,403
16897,282
16898,200
16899,177
16900,107
16901,56
16902,25
16903,8
16904,5
16905,3
16906,3
16907,24
16908,95
16909,299
16910,514
16911,269
16912,136
16913,153
16914,203
16915,202
16916,193
16917,176
16918,239
16919,396
16920,395
16921,261
16922,188
16923,140
16924,102
16925,58
16926,24
16927,10
16928,6
16929,2
16930,4
16931,23
16932,96
16933,288
16934,522
16935,267
16936,156
16937,180
16938,200
16939,217
16940,210
16941,212
16942,245
16943,438
16944,438
16945,276
16946,206
16947,177
16948,115
16949,79
16950,26
16951,10
16952,8
16953,3
16954,3
16955,20
16956,82
16957,267
16958,491
16959,267
16960,138
16961,162
16962,205
16963,209
16964,249
16965,235
16966,270
16967,458
16968,462
16969,305
16970,196
16971,155
16972,112
16973,81
16974,70
16975,58
16976,47
16977,27
16978,8
16979,8
16980,30
16981,50
16982,113
16983,160
16984,250
16985,309
16986,367
16987,372
16988,386
16989,416
16990,376
16991,313
16992,298
16993,213
16994,133
16995,128
16996,125
16997,82
16998,62
16999,51
17000,55
17001,22
17002,8
17003,8
17004,35
17005,53
17006,125
17007,221
17008,231
17009,250
17010,347
17011,364
17012,354
17013,336
17014,327
17015,294
17016,173
17017,195
17018,143
17019,107
17020,109
17021,48
17022,18
17023,10
17024,6
17025,4
17026,4
17027,29
17028,96
17029,342
17030,608
17031,296
17032,162
17033,177
17034,200
17035,197
17036,186
17037,198
17038,227
17039,398
17040,406
17041,324
17042,248
17043,179
17044,112
17045,46
17046,29
17047,13
17048,7
17049,4
17050,5
17051,30
17052,108
17053,369
17054,646
17055,320
17056,178
17057,217
17058,166
17059,262
17060,241
17061,244
17062,271
17063,578
17064,550
17065,379
17066,223
17067,203
17068,123
17069,64
17070,23
17071,10
17072,3
17073,3
17074,3
17075,27
17076,96
17077,304
17078,518
17079,268
17080,141
17081,179
17082,202
17083,216
17084,208
17085,203
17086,254
17087,557
17088,536
17089,375
17090,225
17091,181
17092,135
17093,59
17094,33
17095,13
17096,5
17097,3
17098,4
17099,25
17100,98
17101,336
17102,566
17103,283
17104,145
17105,155
17106,180
17107,169
17108,168
17109,156
17110,222
17111,437
17112,410
17113,253
17114,157
17115,103
17116,75
17117,80
17118,27
17119,24
17120,13
17121,10
17122,4
17123,24
17124,87
17125,298
17126,521
17127,280
17128,160
17129,166
17130,173
17131,170
17132,165
17133,164
17134,212
17135,328
17136,312
17137,242
17138,166
17139,118
17140,87
17141,74
17142,55
17143,49
17144,39
17145,21
17146,6
17147,5
17148,12
17149,35
17150,109
17151,148
17152,203
17153,231
17154,243
17155,267
17156,258
17157,236
17158,209
17159,174
17160,164
17161,146
17162,88
17163,75
17164,71
17165,69
17166,56
17167,52
17168,45
17169,36
17170,11
17171,9
17172,6
17173,27
17174,69
17175,109
17176,177
17177,204
17178,287
17179,306
17180,320
17181,327
17182,311
17183,244
17184,177
17185,150
17186,96
17187,87
17188,97
17189,50
17190,17
17191,7
17192,3
17193,2
17194,19
17195,85
17196,278
17197,481
17198,234
17199,111
17200,107
17201,131
17202,82
17203,81
17204,88
17205,99
17206,197
17207,203
17208,230
17209,139
17210,103
17211,92
17212,39
17213,34
17214,26
17215,24
17216,9
17217,8
17218,9
17219,31
17220,86
17221,120
17222,167
17223,227
17224,234
17225,367
17226,355
17227,303
17228,275
17229,224
17230,199
17231,154
17232,108
17233,82
17234,90
17235,45
17236,17
17237,8
17238,5
17239,2
17240,2
17241,20
17242,94
17243,257
17244,291
17245,145
17246,84
17247,88
17248,87
17249,88
17250,83
17251,96
17252,106
17253,195
17254,198
17255,165
17256,131
17257,123
17258,76
17259,40
17260,15
17261,9
17262,5
17263,3
17264,2
17265,20
17266,95
17267,287
17268,520
17269,248
17270,134
17271,138
17272,154
17273,152
17274,135
17275,137
17276,179
17277,324
17278,305
17279,227
17280,150
17281,114
17282,83
17283,60
17284,25
17285,11
17286,7
17287,4
17288,3
17289,21
17290,85
17291,255
17292,464
17293,259
17294,122
17295,149
17296,174
17297,172
17298,167
17299,175
17300,221
17301,296
17302,295
17303,220
17304,143
17305,109
17306,89
17307,68
17308,53
17309,45
17310,42
17311,28
17312,8
17313,8
17314,10
17315,37
17316,100
17317,159
17318,161
17319,115
17320,118
17321,118
17322,214
17323,203
17324,212
17325,159
17326,157
17327,146
17328,91
17329,70
17330,83
17331,72
17332,59
17333,51
17334,46
17335,31
17336,7
17337,5
17338,7
17339,26
17340,83
17341,115
17342,194
17343,212
17344,226
17345,231
17346,221
17347,217
17348,201
17349,176
17350,159
17351,200
17352,86
17353,64
17354,63
17355,37
17356,14
17357,9
17358,3
17359,2
17360,2
17361,18
17362,90
17363,273
17364,444
17365,226
17366,104
17367,98
17368,110
17369,133
17370,141
17371,144
17372,175
17373,321
17374,312
17375,223
17376,168
17377,113
17378,104
17379,49
