<svg xmlns="http://www.w3.org/2000/svg" width="15" height="16.556" viewBox="0 0 15 16.556">
  <g id="Icon_feather-share-2" data-name="Icon feather-share-2" transform="translate(0.5 0.5)">
    <path id="Path_111" data-name="Path 111" d="M27.167,5.333A2.333,2.333,0,1,1,24.833,3a2.333,2.333,0,0,1,2.333,2.333Z" transform="translate(-13.167 -3)" fill="none" stroke="#fff" stroke-linecap="round" stroke-linejoin="round" stroke-width="1"/>
    <path id="Path_112" data-name="Path 112" d="M9.167,15.833A2.333,2.333,0,1,1,6.833,13.5,2.333,2.333,0,0,1,9.167,15.833Z" transform="translate(-4.5 -8.056)" fill="none" stroke="#fff" stroke-linecap="round" stroke-linejoin="round" stroke-width="1"/>
    <path id="Path_113" data-name="Path 113" d="M27.167,26.333A2.333,2.333,0,1,1,24.833,24,2.333,2.333,0,0,1,27.167,26.333Z" transform="translate(-13.167 -13.111)" fill="none" stroke="#fff" stroke-linecap="round" stroke-linejoin="round" stroke-width="1"/>
    <path id="Path_114" data-name="Path 114" d="M12.885,20.265l5.312,3.1" transform="translate(-8.537 -11.313)" fill="none" stroke="#fff" stroke-linecap="round" stroke-linejoin="round" stroke-width="1"/>
    <path id="Path_115" data-name="Path 115" d="M18.189,9.765l-5.3,3.1" transform="translate(-8.537 -6.257)" fill="none" stroke="#fff" stroke-linecap="round" stroke-linejoin="round" stroke-width="1"/>
  </g>
</svg>
