<svg xmlns="http://www.w3.org/2000/svg" width="64" height="64" viewBox="0 0 64 64">
  <g id="Group_458" data-name="Group 458" transform="translate(-48 -328)">
    <circle id="Ellipse_16" data-name="Ellipse 16" cx="32" cy="32" r="32" transform="translate(48 328)" fill="#161616"/>
    <g id="Group_197" data-name="Group 197" transform="translate(-4405.392 -1938.985)">
      <g id="Group_186" data-name="Group 186" transform="translate(4469.33 2278.53)">
        <path id="Path_64" data-name="Path 64" d="M1957.813,1418.095v-.752a6.863,6.863,0,0,0-13.727,0v.752c-.727,0-1.316.836-1.316,1.865s.589,1.865,1.316,1.865a.638.638,0,0,0,.065,0,6.861,6.861,0,0,0,13.6,0,.617.617,0,0,0,.064,0c.728,0,1.317-.836,1.317-1.865S1958.541,1418.095,1957.813,1418.095Z" transform="translate(-1934.891 -1405.889)" fill="#fff" stroke="#161616" stroke-linecap="round" stroke-linejoin="round" stroke-miterlimit="10" stroke-width="0.5"/>
        <path id="Path_65" data-name="Path 65" d="M2011.88,1556.47" transform="translate(-1995.822 -1534.6)" fill="#fff" stroke="#161616" stroke-linecap="round" stroke-linejoin="round" stroke-miterlimit="10" stroke-width="0.5"/>
        <path id="Path_66" data-name="Path 66" d="M1907.183,1559.218a5.123,5.123,0,0,0-3.875-4.077l-7.975-1.9v-2.657a6.859,6.859,0,0,1-6.15,0v2.657l-7.975,1.9a5.13,5.13,0,0,0-3.878,4.077l-1.13,6.44h32.113Z" transform="translate(-1876.2 -1529.408)" fill="#fff" stroke="#161616" stroke-linecap="round" stroke-linejoin="round" stroke-miterlimit="10" stroke-width="0.5"/>
        <g id="Group_184" data-name="Group 184" transform="translate(9.842 23.715)">
          <path id="Path_67" data-name="Path 67" d="M1962.369,1572.06l-3.009.718,3.477,4.234,2.541-3.1Z" transform="translate(-1959.36 -1572.06)" fill="#fff" stroke="#161616" stroke-linecap="round" stroke-linejoin="round" stroke-miterlimit="10" stroke-width="0.5"/>
          <path id="Path_68" data-name="Path 68" d="M2013.633,1572.29l2.992.715-3.458,4.21-2.957-3.1Z" transform="translate(-2004.192 -1572.263)" fill="#fff" stroke="#161616" stroke-linecap="round" stroke-linejoin="round" stroke-miterlimit="10" stroke-width="0.5"/>
        </g>
        <path id="Path_69" data-name="Path 69" d="M1999.736,1587.68l-1.556,1.9,1.556,1.641,1.685-1.77Z" transform="translate(-1983.743 -1562.117)" fill="#3179f2" stroke="#161616" stroke-miterlimit="10" stroke-width="0.5"/>
        <path id="Path_70" data-name="Path 70" d="M1993,1610.98l-.8.781-.689-.727-1.88,7.844h5.266Z" transform="translate(-1976.205 -1582.659)" fill="#3179f2" stroke="#161616" stroke-miterlimit="10" stroke-width="0.5"/>
        <g id="Group_185" data-name="Group 185" transform="translate(7.424 0)">
          <path id="Path_71" data-name="Path 71" d="M2006.057,1375.509l-.316-3.819h-1.178l-.314,3.819Z" transform="translate(-1996.519 -1371.69)" fill="#5fccf5" stroke="#161616" stroke-miterlimit="10" stroke-width="0.5"/>
          <path id="Path_72" data-name="Path 72" d="M1961.284,1385.549a8.759,8.759,0,0,0-3.133-6.789,7.5,7.5,0,0,0-1.679-1.032l-.173-1.112a7.038,7.038,0,0,0-2.231-.625l.272,3.3h-1.807l.272-3.31a5.751,5.751,0,0,0-2.231.636l-.2,1.112a8.312,8.312,0,0,0-4.284,4.825,9.085,9.085,0,0,0-.5,3h15.694" transform="translate(-1944.802 -1375.472)" fill="#fff" stroke="#161616" stroke-miterlimit="10" stroke-width="0.5"/>
          <line id="Line_77" data-name="Line 77" x2="0.6" y2="3.875" transform="translate(11.497 1.144)" fill="none" stroke="#161616" stroke-miterlimit="10" stroke-width="0.5"/>
          <line id="Line_78" data-name="Line 78" y1="3.875" x2="0.692" transform="translate(5.08 1.144)" fill="none" stroke="#161616" stroke-miterlimit="10" stroke-width="0.5"/>
          <path id="Path_73" data-name="Path 73" d="M1961.828,1422.88a5.609,5.609,0,0,0-.734,2.461H1966" transform="translate(-1958.468 -1416.822)" fill="none" stroke="#161616" stroke-miterlimit="10" stroke-width="0.5"/>
          <path id="Path_74" data-name="Path 74" d="M1955.5,1456.83h-15.861s-.715.027-.709,1.127H1956.2C1956.2,1456.857,1955.5,1456.83,1955.5,1456.83Z" transform="translate(-1938.93 -1446.753)" fill="#fff" stroke="#161616" stroke-miterlimit="10" stroke-width="0.5"/>
        </g>
      </g>
    </g>
  </g>
</svg>
