<svg xmlns="http://www.w3.org/2000/svg" width="8.852" height="15.483" viewBox="0 0 8.852 15.483">
  <path id="Icon_ionic-ios-arrow-back" data-name="Icon ionic-ios-arrow-back" d="M13.919,13.933l5.858-5.854A1.106,1.106,0,0,0,18.21,6.517l-6.637,6.633a1.1,1.1,0,0,0-.032,1.526l6.665,6.679a1.106,1.106,0,0,0,1.567-1.563Z" transform="translate(-11.251 -6.194)" fill="#ffc400"/>
</svg>
