<?xml version="1.0" encoding="utf-8"?>
<!-- Generator: Adobe Illustrator 24.2.3, SVG Export Plug-In . SVG Version: 6.00 Build 0)  -->
<svg version="1.1" id="Layer_1" xmlns="http://www.w3.org/2000/svg" xmlns:xlink="http://www.w3.org/1999/xlink" x="0px" y="0px"
	 viewBox="0 0 176.5 26.5" enable-background="new 0 0 176.5 26.5" xml:space="preserve">
<g>
	<path fill-rule="evenodd" clip-rule="evenodd" d="M43,8.5c-1.9,0-3.5,0.7-4.8,1.7V8.7h-4.4v17.1h4.6V14.9c0.6-0.9,2.2-2.1,4.2-2.1
		c0.7,0,1.3,0.1,1.8,0.3V8.7C43.9,8.6,43.4,8.5,43,8.5"/>
	<path fill-rule="evenodd" clip-rule="evenodd" d="M3.1,20.6c1.2,1.1,3,1.7,4.7,1.7c1.2,0,2.2-0.6,2.2-1.4c0-2.6-8.3-1.7-8.3-7.2
		c0-3.3,3.2-5.3,6.5-5.3c2.2,0,4.6,0.8,5.8,1.7l-2.1,3.3c-0.9-0.6-2-1.2-3.3-1.2c-1.3,0-2.3,0.5-2.3,1.4c0,2.2,8.3,1.3,8.3,7.3
		c0,3.3-3.2,5.3-6.8,5.3c-2.4,0-4.9-0.8-6.9-2.3L3.1,20.6z"/>
	<path fill-rule="evenodd" clip-rule="evenodd" d="M31.8,17.1c0-4.8-3.3-8.8-8.1-8.8c-5.1,0-8.3,4.2-8.3,8.9c0,5.4,3.8,8.9,8.9,8.9
		c2.6,0,5.3-1.1,7-3.1l-2.6-2.6c-0.8,0.9-2.4,2-4.3,2c-2.4,0-4.4-1.7-4.6-4.1h11.8C31.8,18,31.8,17.6,31.8,17.1z M20.1,15.1
		c0.2-1.6,1.8-3,3.7-3c1.9,0,3.2,1.5,3.4,3H20.1z"/>
	<polygon fill-rule="evenodd" clip-rule="evenodd" points="55.2,19.2 59.9,8.7 64.7,8.7 56.8,25.8 53.6,25.8 45.8,8.7 50.5,8.7 	"/>
	<g>
		<path fill-rule="evenodd" clip-rule="evenodd" d="M68.5,0.7c1.7,0,3,1.3,3,2.9c0,1.7-1.3,2.9-3,2.9c-1.7,0-3-1.3-3-2.9
			C65.5,1.9,66.8,0.7,68.5,0.7"/>
		<rect x="66.2" y="8.7" fill-rule="evenodd" clip-rule="evenodd" width="4.6" height="17.1"/>
	</g>
	<path fill-rule="evenodd" clip-rule="evenodd" d="M89.7,22.3c-2,2.7-4.5,3.8-7.7,3.8c-5.3,0-9.1-4-9.1-8.9c0-5,4-8.9,9.2-8.9
		c3,0,5.6,1.4,7.2,3.4l-3.2,2.9c-0.9-1.2-2.3-2-3.9-2c-2.6,0-4.6,2.1-4.6,4.7c0,2.7,1.9,4.7,4.7,4.7c1.9,0,3.3-1.1,4.1-2.3
		L89.7,22.3z"/>
	<path fill-rule="evenodd" clip-rule="evenodd" d="M106.3,23.1c-1.7,2-4.4,3.1-7,3.1c-5.1,0-8.9-3.5-8.9-8.9c0-4.8,3.2-8.9,8.3-8.9
		c4.7,0,8.1,4,8.1,8.8c0,0.5,0,0.9-0.1,1.3H94.8c0.2,2.4,2.2,4.1,4.6,4.1c1.9,0,3.5-1.1,4.3-2L106.3,23.1z M102,15.1
		c-0.1-1.5-1.5-3-3.4-3c-1.9,0-3.4,1.4-3.7,3H102z"/>
	<path fill-rule="evenodd" clip-rule="evenodd" d="M108.5,25.8V8.7h4.4v1.4c1.3-1.1,2.9-1.7,4.8-1.7c2.4,0,4.5,1.1,5.9,2.8
		c1.1,1.3,1.8,3.1,1.8,6v8.7h-4.6v-9.1c0-1.7-0.4-2.6-1-3.2c-0.6-0.6-1.5-1-2.6-1c-1.9,0-3.5,1.2-4.2,2.1v11.1H108.5z"/>
	<path fill-rule="evenodd" clip-rule="evenodd" d="M137.2,8.4c-5.5,0-10,4.4-10,9.9c0,2.9,1.2,5.5,3.1,7.4c0.7,0.7,1.8,0.7,2.6,0.1
		c1.1-0.9,2.6-1.4,4.3-1.4c1.7,0,3.1,0.5,4.3,1.4c0.8,0.6,1.9,0.5,2.6-0.2c1.9-1.8,3.1-4.4,3.1-7.3C147.1,12.9,142.7,8.4,137.2,8.4
		 M137.1,23.4c-3,0-5-2.2-5-5c0-2.8,2-5,5-5c3,0,5,2.3,5,5C142.1,21.1,140.1,23.4,137.1,23.4"/>
	<g>
		<polygon fill-rule="evenodd" clip-rule="evenodd" points="156.2,25.8 152.8,25.8 146,8.7 150.5,8.7 154.2,18.5 157.9,8.7 
			161.7,8.7 165.3,18.5 169.1,8.7 173.7,8.7 166.9,25.8 163.5,25.8 159.8,16.1 		"/>
	</g>
	<g>
		<g>
			<path d="M173.7,23.9h-0.4v0.7H173v-2h0.8c0.4,0,0.6,0.3,0.6,0.6c0,0.3-0.2,0.5-0.4,0.6l0.5,0.8h-0.4L173.7,23.9z M173.3,23.6h0.5
				c0.2,0,0.3-0.1,0.3-0.3c0-0.2-0.1-0.3-0.3-0.3h-0.5V23.6z"/>
		</g>
		<path d="M173.7,21.8c1,0,1.8,0.8,1.8,1.8c0,1-0.8,1.8-1.8,1.8s-1.8-0.8-1.8-1.8C171.8,22.7,172.7,21.8,173.7,21.8 M173.7,21.5
			c-1.2,0-2.1,1-2.1,2.1c0,1.2,1,2.1,2.1,2.1c1.2,0,2.1-1,2.1-2.1C175.8,22.5,174.8,21.5,173.7,21.5L173.7,21.5z"/>
	</g>
</g>
</svg>
