// Jest Snapshot v1, https://goo.gl/fbAQLP

exports[`molecules > HeaderBrand snapshot 1`] = `
<DocumentFragment>
  .emotion-1 {
  display: -webkit-box;
  display: -webkit-flex;
  display: -ms-flexbox;
  display: flex;
  -webkit-align-items: center;
  -webkit-box-align: center;
  -ms-flex-align: center;
  align-items: center;
  font-size: 1em;
  height: var(--header-height-sm);
}

@media (min-width:576px) {
  .emotion-1 {
    font-size: 1em;
  }
}

@media (min-width:992px) {
  .emotion-1 {
    height: var(--header-height);
    font-size: 1.5em;
  }
}

.emotion-1 a {
  -webkit-text-decoration: none;
  text-decoration: none;
  color: var(--text-color);
  cursor: pointer;
}

.emotion-0 {
  font-family: 'Anton';
  font-size: 1em;
  margin-right: 1em;
}

.emotion-0 > span {
  color: var(--color-chi-gong);
}

<div
    class="emotion-1"
  >
    <a
      href="/"
    >
      <span
        class="emotion-0"
      >
        M
        <span>
          H
        </span>
      </span>
    </a>
  </div>
</DocumentFragment>
`;
