<svg width="408" height="55" viewBox="0 0 408 55" fill="none" xmlns="http://www.w3.org/2000/svg">
<path d="M0 54.086H8.2177V29.8972H28.4668V22.4953H8.2177V8.79252H28.4668V1.39062H0V54.086Z" fill="white"/>
<path d="M55.5077 1.39062H47.29V54.086H55.5077V1.39062Z" fill="white"/>
<path d="M72.5134 8.71363H90.3085V54.0867H98.566V8.71363H116.66V1.31836H72.5134V8.71363Z" fill="white"/>
<path d="M177.387 8.37533C172.001 3.24839 165.17 0.648438 157.085 0.648438C149 0.648438 142.208 3.24839 136.909 8.37533C131.603 13.5089 128.916 20.0751 128.916 27.9015C128.916 35.5289 131.589 41.9691 136.856 47.043C142.115 52.1102 148.787 54.677 156.68 54.677C164.938 54.677 171.882 52.1102 177.314 47.0496C182.759 41.9823 185.518 35.4891 185.518 27.7556C185.512 20.0287 182.779 13.5023 177.387 8.37533ZM177.075 27.6097C177.075 33.1213 175.158 37.7906 171.384 41.4849C167.604 45.1858 162.822 47.0562 157.164 47.0562C151.533 47.0562 146.778 45.219 143.03 41.591C139.29 37.9697 137.399 33.3667 137.399 27.9015C137.399 22.2638 139.29 17.5746 143.017 13.9533C146.745 10.3319 151.58 8.49472 157.39 8.49472C162.901 8.49472 167.611 10.3518 171.391 14.013C175.158 17.6741 177.075 22.2439 177.075 27.6097Z" fill="white"/>
<path d="M221.951 1.31836H205.098V54.0867H213.348V31.5693H218.455C223.39 31.5693 227.237 31.0254 229.897 29.9642C232.589 28.8831 234.738 27.1255 236.284 24.7444C237.829 22.3634 238.612 19.591 238.612 16.5068C238.612 11.9039 237.08 8.18302 234.062 5.43716C231.057 2.69792 226.985 1.31836 221.951 1.31836ZM230.142 16.3145C230.142 18.8349 229.359 20.7915 227.827 22.1312C226.275 23.4843 224.013 24.174 221.102 24.174H213.355V8.72026H220.651C227.038 8.71363 230.142 11.2008 230.142 16.3145Z" fill="white"/>
<path d="M274.182 1.09375H268.445L245.808 54.0876H254.304L271.257 13.8813L289.337 54.0876H297.807L274.281 1.32589L274.182 1.09375Z" fill="white"/>
<path d="M322.155 31.2702H343.406V23.8351H322.155V8.79252H344.149V1.39062H313.937V54.0065H344.858V46.6112H322.155V31.2702Z" fill="white"/>
<path d="M408 1.31836H362.096V8.71363H392.798L359.596 54.0867H407.615V46.6848H374.837L408 1.31836Z" fill="white"/>
</svg>
