[

    {
        "id": 2,
        "nickName": "User_1",
        "gender": 1,
        "avatar": "/web/images/people/man.png",
        "description": "Proin dolor ligula, molestie non rutrum ut, iaculis sed turpis"
    },
    {
        "id": 4,
        "nickName": "User_2",
        "gender": 2,
        "avatar": "/web/images/people/woman.png",
        "description": "Morbi a volutpat enim, non hendrerit nulla. Proin ac urna ut dolor sollicitudin pulvinar."
    },
    {
        "id": 6,
        "nickName": "User_3",
        "gender": 1,
        "avatar": "/web/images/people/man.png",
        "description": "Morbi a volutpat enim, non hendrerit nulla. Proin ac urna ut dolor sollicitudin pulvinar."
    },
    {
        "id": 10,
        "nickName": "Ben",
        "gender": 1,
        "avatar": "/web/images/people/man.png",
        "description": "Proin dolor ligula, molestie non rutrum ut, iaculis sed turpis. "
    },
    {
        "id": 15,
        "nickName": "User_4",
        "gender": 2,
        "avatar": "/web/images/people/woman.png",
        "description": "test test"
    },
    {
        "id": 16,
        "nickName": "User_5",
        "gender": 2,
        "avatar": "/web/images/people/woman.png",
        "description": "Sed non lacinia nisi."
    },
    {
        "id": 18,
        "nickName": "Kate",
        "gender": 2,
        "avatar": "/web/images/people/woman.png",
        "description": "Dear Kate"
    },
    {
        "id": 19,
        "nickName": "John",
        "gender": 1,
        "avatar": "/web/images/people/man.png",
        "description": "Sed blandit vel mauris sed elementum."
    },
    {
        "id": 20,
        "nickName": "Monica",
        "gender": 2,
        "avatar": "/web/images/people/woman.png",
        "description": "Mauris maximus et metus nec elementum."
    },
    {
        "id": 135,
        "nickName": "User_6",
        "gender": 2,
        "avatar": "/web/images/people/woman.png",
        "description": "Mauris maximus et metus nec elementum."
    },
    {
        "id": 137,
        "nickName": "Ross",
        "gender": 1,
        "avatar": "/web/images/people/man.png",
        "description": "Sed blandit vel mauris sed elementum."
    },
    {
        "id": 139,
        "nickName": "User_7",
        "gender": 2,
        "avatar": "/web/images/people/woman.png",
        "description": "Donec nunc lorem, mollis id pellentesque nec, bibendum sed tortor."
    }
]