
  {
    "text": "<p>Curabitur facilisis felis sed urna congue, quis egestas nisi aliquet. Proin id facilisis justo. Proin dictum sodales odio nec ullamcorper. Ut semper, leo in condimentum varius, mi nunc elementum tortor, et ultricies metus sem nec sem. Nulla vestibulum, felis sed tincidunt tempor, diam odio consequat leo, ac elementum libero arcu sit amet dui. Cras non enim ac diam sagittis auctor.</p><p>Mauris dapibus lacinia blandit. Suspendisse nunc odio, accumsan id venenatis sit amet, dapibus sed justo. Donec nulla dui, lacinia tempus nisi eu, lobortis sodales dolor. Sed sed ligula id libero congue auctor. Nullam congue a lectus at aliquam. Interdum et malesuada fames ac ante ipsum primis in faucibus. Morbi rhoncus vehicula cursus. Pellentesque scelerisque, quam at accumsan interdum, eros purus dapibus turpis, pretium auctor augue sem sit amet neque.</p>"
  }
