[
    {
        "id": 2,
        "name": "New Year",
        "float_date": 0,
        "country_id": 0,
        "min_age": 0,
        "sex": 3,
        "date": "2017-01-01",
        "notifyPeriod": 30,
        "image_square": "/web/images/main_page/new_year.png",
        "image_rect": "/web/images/main_page/new_year_small.png",
        "holiday_type_id": 0,
        "religion_id": 0
    }
]