[
    {
        "id": 2,
        "client": 1,
        "lang": "en",
        "question": "Nam faucibus enim in nisl posuere mollis in ut ipsum?",
        "answer": "Lorem ipsum dolor sit amet, consectetur adipiscing elit. Pellentesque in finibus purus. In congue sagittis arcu, in bibendum dui pharetra pretium. Duis faucibus lectus id condimentum vulputate. Donec a iaculis erat. Nulla lobortis varius orci sit amet iaculis. Quisque sollicitudin tempor justo sed tincidunt. In hac habitasse platea dictumst. Nullam eleifend efficitur ligula vitae euismod. Praesent vehicula augue a ligula maximus, quis fermentum massa consequat. Proin ultrices faucibus euismod. Pellentesque dictum orci quis iaculis consectetur. Nam dapibus neque ac sem pharetra commodo."
    },
    {
        "id": 8,
        "client": 1,
        "lang": "en",
        "question": "Lorem ipsum dolor sit amet, consectetur adipiscing elit?",
        "answer": "Cras sed nibh vitae orci accumsan viverra quis sit amet dolor. Vivamus et nisi sit amet sapien suscipit condimentum sit amet eget risus. Donec eget sapien mauris. Integer cursus eget dolor pretium egestas. Ut maximus porttitor nunc, ac ultrices nunc semper sed. Class aptent taciti sociosqu ad litora torquent per conubia nostra, per inceptos himenaeos. Nunc vitae lacinia mauris, in tristique odio. Ut pretium ipsum at lorem rutrum, eu faucibus est vulputate. "
    },
    {
        "id": 10,
        "client": 1,
        "lang": "en",
        "question": "Nulla sed leo imperdiet, scelerisque sapien in, interdum sem?",
        "answer": " Nunc sem justo, fermentum sit amet mollis eget, dignissim non diam. Donec lorem urna, rhoncus venenatis mollis nec, auctor a dolor. Sed posuere mattis leo, sit amet lacinia augue hendrerit a. Nunc lacinia lorem sit amet est suscipit, eu volutpat lacus vestibulum. Nunc pharetra leo libero, et pellentesque nunc convallis quis. Nulla vel mi sodales, ultrices lorem id, gravida leo. Nulla vel facilisis ante."
    }
]
