
  {
    "text": "<p>Lorem ipsum dolor sit amet, consectetur adipiscing elit. Nullam volutpat condimentum nisl, semper mattis erat. Quisque facilisis dui at lorem lobortis, sit amet tincidunt libero placerat. In imperdiet, metus vel sodales semper, mi nisl pharetra justo, et interdum mi leo id sem. Pellentesque non enim semper, tristique neque semper, pharetra nisl. Nullam non libero at urna feugiat pretium. Etiam eget lectus euismod, eleifend erat nec, facilisis magna. Nullam sit amet sodales tellus. Sed nec dolor in felis euismod hendrerit nec non libero. Aenean quis quam erat. Phasellus pulvinar rutrum nibh at tempus. Morbi nec posuere ex.</p><p>Quisque vitae sodales est. Vestibulum a mi augue. Sed ut vehicula ipsum, nec tempus erat. Ut efficitur vulputate condimentum. Nulla nec sem non ipsum luctus faucibus bibendum non erat. Cras mollis nulla id sapien aliquam aliquam. Quisque eget euismod velit, et hendrerit odio. Pellentesque ullamcorper ipsum et turpis mattis, non mollis nisl tincidunt. Phasellus accumsan id lectus non fermentum. Nunc mollis dapibus tortor, et iaculis purus scelerisque vitae. Ut nec fermentum tellus. Morbi et diam in turpis pellentesque scelerisque. Phasellus cursus sapien rhoncus purus tincidunt, sed accumsan leo condimentum.</p>"
  }
