6.994535319386146,6.235778524258676,173.7814797358004,-119,1562,16129,-1,-1,3,17.0,122.0,114.75
11.760350991720834,9.69033528304432,169.44421577520225,-137,1549,16177,-1,0,1,18.75,120.0,113.125
14.864132124402756,11.550015210720781,165.7903574158924,-136,1542,16193,1,0,1,19.5,123.375,110.125
16.628098419876007,12.228111430721235,162.93605175449156,-125,1570,16207,-1,-2,1,18.75,118.875,112.125
17.566522952400486,12.416550289936266,160.34265467565407,-138,1559,16200,1,1,0,19.5,121.875,114.625
18.054402885409942,12.496664404455478,157.83512700566064,-133,1551,16214,4,0,1,17.375,123.25,113.375
18.133866962642884,12.3444970259314,155.50086979546117,-135,1574,16221,0,-1,0,17.875,123.0,114.375
17.844786396161915,11.900685924462373,153.3369297723545,-121,1565,16226,0,0,0,21.625,118.875,112.5
17.494408766346332,11.585200256671708,151.24103424455862,-127,1569,16237,-2,0,1,20.375,122.875,116.75
17.117535724093184,11.374350517852784,149.03662103653443,-135,1547,16237,0,0,1,21.625,121.875,110.375
16.534891949617496,10.93901120319508,147.16978303253435,-138,1571,16233,0,1,1,21.625,119.5,116.75
16.106687229736966,10.834919796368668,145.1427529779563,-118,1543,16233,-1,-1,1,18.5,122.625,114.75
15.721529776948369,10.817861599443898,143.1333578516957,-94,1580,16226,-4,-2,0,14.75,121.0,113.375
15.191543785316979,10.587814717095528,141.30747087549656,-104,1562,16237,-3,0,2,16.0,119.125,115.0
6.983379209187339,6.277318858514937,173.7053726253903,-137,1570,16224,-2,0,1,16.5,121.75,113.125
11.7757664938112,9.794518767245888,169.2775621938556,-157,1575,16243,1,0,-3,18.5,122.25,113.375
14.83611648841497,11.530235774104728,165.78917985119145,-128,1576,16230,-1,0,-2,19.5,122.5,112.75
16.609189112837143,12.23051944055271,162.9736644689324,-133,1582,16235,0,1,-3,18.25,120.0,114.25
17.581040908052493,12.492865021869088,160.36547254848108,-159,1563,16223,-1,2,-2,18.125,120.375,112.875
18.02284650649033,12.441635554042751,157.90134852574008,-136,1586,16250,2,0,-3,18.875,119.75,111.375
18.01600378883953,12.139133352052216,155.68542646157655,-131,1593,16259,-4,-1,-2,19.25,118.75,114.0
17.898475434291512,11.985820554197616,153.4813630551888,-135,1578,16244,0,1,-3,16.75,119.625,113.125
17.516089821121234,11.576181375647305,151.4320197697311,-122,1597,16241,-3,0,-3,20.5,118.5,114.0
17.16052929619675,11.422956151978248,149.3598465433393,-143,1568,16246,0,1,-3,17.0,118.75,112.875
16.680371219702042,11.133708242475532,147.43599737054438,-139,1586,16228,0,1,-4,18.375,121.0,117.875
16.28662251638036,11.057875420206987,145.3786806410498,-125,1581,16255,-4,0,-3,16.375,119.125,111.0
15.776282572460303,10.790230658322818,143.40229851642982,-141,1591,16247,-1,0,-3,20.625,121.0,111.625
15.159839523400558,10.403403054448672,141.61458321293014,-154,1574,16231,-3,-1,-2,21.5,118.875,113.625
14.722973898832118,10.343954211510873,139.71969822843633,-143,1578,16237,-1,-1,-3,16.375,119.875,112.75
14.173838581544743,10.037130844475918,137.94242381116368,-139,1576,16242,-2,0,-1,20.75,119.5,111.25
13.71326533896621,9.87375094130566,136.12555157396613,-117,1576,16215,-1,1,-2,18.875,123.375,113.5
13.151864712671337,9.496600357676357,134.50362939204328,-138,1572,16247,1,0,-2,21.625,119.75,112.125
12.715087231080071,9.343264268165523,132.82645232975509,-127,1571,16240,1,0,-1,18.125,122.875,114.875
12.227678344914112,9.030060497954764,131.28622520686508,-132,1581,16243,-2,1,-2,20.375,121.25,113.625
11.772391561392713,8.721878483848549,129.8423856342976,-124,1588,16230,-1,0,-4,19.0,118.25,113.75
11.43384169119139,8.689568699770232,128.226528276534,-140,1576,16259,-1,0,-3,16.125,122.25,112.5
11.004617101775587,8.321607039052063,126.8608546144616,-124,1593,16237,0,1,0,20.25,121.125,112.625
10.634081608740264,8.120401690186055,125.49043944456025,-146,1572,16226,-2,-1,-1,17.5,123.25,116.75
10.299425049953271,7.966457937938072,124.08277886511637,-124,1559,16225,-2,1,-1,16.5,122.75,113.125
9.92862325345862,7.632093238364037,122.87276843622138,-153,1579,16222,-2,0,-2,18.875,121.375,113.625
9.659324146620863,7.487617018517947,121.54286887065126,-143,1591,16224,-1,-1,-3,16.5,122.875,111.25
9.37673950751764,7.305363318622671,120.28249646393847,-145,1580,16239,-4,-2,-1,16.125,123.75,112.375
