{
    "themes": [
        {
            "name": "default_oltranz",
            "types": [
                "login",
                "email",
                "welcome",
                "admin",
                "account"
            ]
        },{
            "name": "chenosis",
            "types": [
                "login",
                "email",
                "welcome",
                "admin",
                "account"
            ]
        },
        {
            "name": "basesuite-upd",
            "types": [
                "login",
                "email",
                "welcome",
                "admin",
                "account"
            ]
        },
        {
            "name": "mkel",
            "types": [
                "login",
                "email",
                "welcome",
                "admin",
                "account"
            ]
        },
        {
            "name": "basesuite",
            "types": [
                "login",
                "email",
                "welcome",
                "admin",
                "account"
            ]
        },
        {
            "name": "dubaivisa",
            "types": [
                "login",
                "email",
                "welcome",
                "admin",
                "account"
            ]
        }
    ]
}