<?xml version="1.0" encoding="UTF-8" standalone="no"?>
<!-- Generator: Adobe Illustrator 18.1.0, SVG Export Plug-In . SVG Version: 6.00 Build 0)  -->

<svg
   xmlns:dc="http://purl.org/dc/elements/1.1/"
   xmlns:cc="http://creativecommons.org/ns#"
   xmlns:rdf="http://www.w3.org/1999/02/22-rdf-syntax-ns#"
   xmlns:svg="http://www.w3.org/2000/svg"
   xmlns="http://www.w3.org/2000/svg"
   xmlns:sodipodi="http://sodipodi.sourceforge.net/DTD/sodipodi-0.dtd"
   xmlns:inkscape="http://www.inkscape.org/namespaces/inkscape"
   version="1.1"
   id="Layer_1"
   x="0px"
   y="0px"
   viewBox="-75 45 139.42 140"
   enable-background="new -75 45 150 150"
   xml:space="preserve"
   inkscape:version="0.48.5 r10040"
   width="100%"
   height="100%"
   sodipodi:docname="full-screen.svg"><metadata
     id="metadata15"><rdf:RDF><cc:Work
         rdf:about=""><dc:format>image/svg+xml</dc:format><dc:type
           rdf:resource="http://purl.org/dc/dcmitype/StillImage" /></cc:Work></rdf:RDF></metadata><defs
     id="defs13" /><sodipodi:namedview
     pagecolor="#ffffff"
     bordercolor="#666666"
     borderopacity="1"
     objecttolerance="10"
     gridtolerance="10"
     guidetolerance="10"
     inkscape:pageopacity="0"
     inkscape:pageshadow="2"
     inkscape:window-width="1280"
     inkscape:window-height="751"
     id="namedview11"
     showgrid="false"
     fit-margin-top="10"
     fit-margin-left="10"
     fit-margin-right="10"
     fit-margin-bottom="10"
     inkscape:zoom="0.27813"
     inkscape:cx="69.704"
     inkscape:cy="70.016"
     inkscape:window-x="1"
     inkscape:window-y="1"
     inkscape:window-maximized="0"
     inkscape:current-layer="Layer_1" /><path
     id="path9"
     d="M 51.3,55 H -61.4 c -1.8,0 -3.6,1.8 -3.6,3.6 v 112.2 c 0,2.4 1.8,4.2 3.6,4.2 H 50.7 c 2.4,0 3.6,-1.8 3.6,-3.6 V 58.6 C 54.9,56.8 53.1,55 51.3,55 z M 47.1,167.2 H -57.3 V 62.8 H 47.1 v 104.4 l 0,0 z m -91.2,-10.8 0,0 22.2,-3.6 c 0.6,0 1.8,-0.6 1.8,-1.8 0,-0.6 0,-1.8 -0.6,-2.4 l -5.4,-5.4 49.2,-49.2 5.4,5.4 c 0.6,0.6 1.2,0.6 1.8,0.6 h 0.6 c 0.6,0 1.2,-1.2 1.8,-1.8 L 36.4,76 c 0,-0.6 0,-1.2 -0.6,-1.8 -0.6,-0.6 -1.2,-0.6 -1.8,-0.6 l -22.3,3.6 c -0.6,0 -1.8,0.6 -1.8,1.8 0,0.6 0,1.8 0.6,2.4 l 5.4,5.4 -49.2,49.2 -5.4,-5.4 c -0.6,-0.6 -1.8,-0.6 -2.4,-0.6 -0.6,0 -1.2,1.2 -1.8,1.8 l -3.6,22.2 c 0,0.6 0,1.2 0.6,1.8 0.6,0.6 1.2,0.6 1.8,0.6 z" /></svg>