v 20130925 2
C 40000 40000 0 0 0 title-B.sym
C 48900 45900 1 0 0 lm7805-1.sym
{
T 50500 47200 5 10 0 0 0 0 1
device=7805
T 50300 46900 5 10 1 1 0 6 1
refdes=U2
T 49200 46900 5 10 1 1 0 0 1
value=LM7805
T 48900 45900 5 10 0 0 0 0 1
footprint=TO220
T 48900 45900 5 10 0 0 0 0 1
net=5V:3
T 48900 45900 5 10 0 0 0 0 1
net=12V:1
T 48900 45900 5 10 0 0 0 0 1
net=GND:2
T 48900 45900 5 10 0 0 0 0 1
net=GND:4
}
C 46500 45900 1 0 0 lm7812-1.sym
{
T 48100 47200 5 10 0 0 0 0 1
device=7812
T 47900 46900 5 10 1 1 0 6 1
refdes=U1
T 46800 46900 5 10 1 1 0 0 1
value=LM7812
T 46500 45900 5 10 0 0 0 0 1
footprint=TO220
T 46500 45900 5 10 0 0 0 0 1
net=12V:3
T 46500 45900 5 10 0 0 0 0 1
net=VCC:1
T 46500 45900 5 10 0 0 0 0 1
net=GND:2
T 46500 45900 5 10 0 0 0 0 1
net=GND:4
}
C 45900 46000 1 270 0 capacitor-4.sym
{
T 47000 45800 5 10 0 0 270 0 1
device=POLARIZED_CAPACITOR
T 46400 45800 5 10 1 1 270 0 1
refdes=C1
T 46600 45800 5 10 0 0 270 0 1
symversion=0.1
T 46400 45400 5 10 1 1 270 0 1
value=100 μF
T 45900 46000 5 10 0 0 0 0 1
footprint=RCY250P
}
C 50600 46000 1 270 0 capacitor-4.sym
{
T 51700 45800 5 10 0 0 270 0 1
device=POLARIZED_CAPACITOR
T 51100 45800 5 10 1 1 270 0 1
refdes=C3
T 51300 45800 5 10 0 0 270 0 1
symversion=0.1
T 51100 45400 5 10 1 1 270 0 1
value=0.33 μF
T 50600 46000 5 10 0 0 0 0 1
footprint=RCY100P
}
C 48300 46000 1 270 0 capacitor-4.sym
{
T 49400 45800 5 10 0 0 270 0 1
device=POLARIZED_CAPACITOR
T 48800 45800 5 10 1 1 270 0 1
refdes=C2
T 49000 45800 5 10 0 0 270 0 1
symversion=0.1
T 48800 45400 5 10 1 1 270 0 1
value=0.33 μF
T 48300 46000 5 10 0 0 0 0 1
footprint=RCY100P
}
C 51500 45500 1 270 0 led-1.sym
{
T 52100 44700 5 10 0 0 270 0 1
device=LED
T 51900 44700 5 10 1 1 270 0 1
refdes=LED3
T 52300 44700 5 10 0 0 270 0 1
symversion=0.1
T 51500 45600 5 10 1 1 270 0 1
value=Red
T 51500 45500 5 10 0 1 0 0 1
footprint=LED3
}
T 50000 40700 9 10 1 0 0 0 1
5 v, 12 v and 24 v testbench
T 51000 40100 9 10 1 0 0 0 1
1
T 51500 40100 9 10 1 0 0 0 1
2
T 53800 40400 9 10 1 0 0 0 1
1.0
T 53900 40100 9 10 1 0 0 0 1
Olliver Schinagl
C 52200 45500 1 270 0 led-1.sym
{
T 52800 44700 5 10 0 0 270 0 1
device=LED
T 52600 44700 5 10 1 1 270 0 1
refdes=LED2
T 53000 44700 5 10 0 0 270 0 1
symversion=0.1
T 52200 45800 5 10 1 1 270 0 1
value=Amber
T 52200 45500 5 10 0 1 0 0 1
footprint=LED3
}
C 52900 45500 1 270 0 led-1.sym
{
T 53500 44700 5 10 0 0 270 0 1
device=LED
T 53300 44700 5 10 1 1 270 0 1
refdes=LED1
T 53700 44700 5 10 0 0 270 0 1
symversion=0.1
T 52900 45800 5 10 1 1 270 0 1
value=Green
T 52900 45500 5 10 0 1 0 0 1
footprint=LED3
}
C 53000 47800 1 270 0 resistor-2.sym
{
T 53350 47400 5 10 0 0 270 0 1
device=RESISTOR
T 53300 47600 5 10 1 1 270 0 1
refdes=R1
T 53300 47200 5 10 1 1 270 0 1
value=1k2
T 53000 47800 5 10 0 0 0 0 1
footprint=R025
}
C 52300 47000 1 270 0 resistor-2.sym
{
T 52650 46600 5 10 0 0 270 0 1
device=RESISTOR
T 52600 46800 5 10 1 1 270 0 1
refdes=R2
T 52600 46400 5 10 1 1 270 0 1
value=560
T 52300 47000 5 10 0 0 0 0 1
footprint=R025
}
C 51600 46500 1 270 0 resistor-2.sym
{
T 51950 46100 5 10 0 0 270 0 1
device=RESISTOR
T 51900 46300 5 10 1 1 270 0 1
refdes=R3
T 51900 46000 5 10 1 1 270 0 1
value=150
T 51600 46500 5 10 0 1 0 0 1
footprint=R025
}
T 49900 40400 9 10 1 0 0 0 1
Testbench_v1.sch
N 43200 44800 44100 44800 4
N 43200 44500 54800 44500 4
C 44000 43800 1 0 0 gnd-1.sym
N 44100 45700 44100 44800 4
N 44100 44100 44100 44500 4
N 45300 44800 45600 44800 4
N 45600 44800 45600 48000 4
N 45600 46500 46500 46500 4
N 47300 45900 47300 44500 4
N 49700 45900 49700 44500 4
N 48100 46500 48500 46500 4
N 48500 46000 48500 47300 4
N 48500 47300 54800 47300 4
N 50500 46500 54800 46500 4
N 46100 46000 46100 46500 4
N 45600 48000 54800 48000 4
N 48500 44500 48500 45100 4
N 48500 46500 48900 46500 4
N 50800 44500 50800 45100 4
N 50800 46500 50800 46000 4
N 51700 45500 51700 45600 4
N 51700 44600 51700 44500 4
N 46100 44500 46100 45100 4
N 52400 47000 52400 47300 4
N 52400 46100 52400 45500 4
N 53100 45500 53100 46900 4
N 52400 44500 52400 44600 4
N 53100 44500 53100 44600 4
N 53100 48000 53100 47800 4
C 54800 44400 1 0 0 output-1.sym
{
T 54900 44700 5 10 0 0 0 0 1
device=OUTPUT
T 55100 44700 5 10 1 1 0 0 1
value=GND
T 54800 44400 5 10 0 0 0 0 1
net=GND
}
C 54800 46400 1 0 0 output-1.sym
{
T 54900 46700 5 10 0 0 0 0 1
device=OUTPUT
T 54800 46400 5 10 0 0 0 0 1
net=5V
T 55100 46700 5 10 1 1 0 0 1
value=5V
}
C 54800 47200 1 0 0 output-1.sym
{
T 54900 47500 5 10 0 0 0 0 1
device=OUTPUT
T 54800 47200 5 10 0 0 0 0 1
net=12V
T 55100 47500 5 10 1 1 0 0 1
value=12V
}
C 54800 47900 1 0 0 output-1.sym
{
T 54900 48200 5 10 0 0 0 0 1
device=OUTPUT
T 54800 47900 5 10 0 0 0 0 1
net=VCC
T 55100 48200 5 10 1 1 0 0 1
value=VCC
}
C 44400 44800 1 0 0 switch-spdt-1.sym
{
T 44800 45600 5 10 0 0 0 0 1
device=SPDT
T 44800 45400 5 10 1 1 0 0 1
refdes=SW1
T 44400 44800 5 10 0 1 0 0 1
footprint=4MS1R202
T 44400 44800 5 10 0 0 0 0 1
net=VCC_SRC:1
T 44400 44800 5 10 0 0 0 0 1
net=VCC_SRC:2
T 44400 44800 5 10 0 0 0 0 1
net=VCC:3
}
N 45300 45200 45300 45400 4
N 44100 45400 43200 45400 4
C 41500 44300 1 0 0 connector5-1.sym
{
T 43300 45800 5 10 0 0 0 0 1
device=CONNECTOR_5
T 41600 46000 5 10 1 1 0 0 1
refdes=J1
T 41500 44300 5 10 0 1 0 0 1
footprint=Kycon_KPJX-4S-S
T 41500 44300 5 10 0 0 0 0 1
net=GND:1
T 41500 44300 5 10 0 0 0 0 1
net=GND:3
T 41500 44300 5 10 0 0 0 0 1
net=GND:5
T 41500 44300 5 10 0 0 0 0 1
net=VCC_SRC:2
T 41500 44300 5 10 0 0 0 0 1
net=VCC_SRC:4
}
N 43400 44500 43400 45700 4
N 43400 45100 43200 45100 4
N 43400 45700 43200 45700 4
N 44100 45400 45300 45400 4
N 44100 45000 44400 45000 4
C 43900 45700 1 0 0 vcc-1.sym
{
T 43900 45700 5 10 0 0 0 0 1
net=VCC_SRC
}
