v 20130925 2
C 40000 40000 0 0 0 title-B.sym
C 45100 48500 1 180 0 connector2-1.sym
{
T 44900 47500 5 10 0 0 180 0 1
device=CONNECTOR_2
T 45100 47700 5 10 1 1 180 0 1
refdes=CONN1_1
T 45100 48500 5 10 0 0 0 0 1
footprint=JUMPER2
T 45100 48500 5 10 0 0 0 0 1
net=GND:2
T 45100 48500 5 10 0 0 0 0 1
net=VCC:1
}
C 40700 48200 1 0 0 input-2.sym
{
T 41300 48900 5 10 0 0 0 0 1
device=none
T 40700 48400 5 10 0 0 0 0 1
net=GND
T 41200 48300 5 10 1 1 0 7 1
value=GND
}
C 41900 47900 1 0 0 input-2.sym
{
T 42500 48600 5 10 0 0 0 0 1
device=none
T 41900 48100 5 10 0 0 0 0 1
net=VCC
T 42400 48000 5 10 1 1 0 7 1
value=VCC
}
N 42100 48300 43400 48300 4
N 43300 48000 43400 48000 4
C 50600 48500 1 180 0 connector2-1.sym
{
T 50400 47500 5 10 0 0 180 0 1
device=CONNECTOR_2
T 50600 47700 5 10 1 1 180 0 1
refdes=CONN2_1
T 50600 48500 5 10 0 1 0 0 1
footprint=JUMPER2
T 50600 48500 5 10 0 0 0 0 1
net=GND:2
T 50600 48500 5 10 0 0 0 0 1
net=12V:1
}
C 46200 48200 1 0 0 input-2.sym
{
T 46800 48900 5 10 0 0 0 0 1
device=none
T 46200 48400 5 10 0 0 0 0 1
net=GND
T 46700 48300 5 10 1 1 0 7 1
value=GND
}
C 47400 47900 1 0 0 input-2.sym
{
T 48000 48600 5 10 0 0 0 0 1
device=none
T 47400 48100 5 10 0 0 0 0 1
net=12V
T 47900 48000 5 10 1 1 0 7 1
value=12V
}
N 47600 48300 48900 48300 4
N 48800 48000 48900 48000 4
C 56100 48500 1 180 0 connector2-1.sym
{
T 55900 47500 5 10 0 0 180 0 1
device=CONNECTOR_2
T 56100 47700 5 10 1 1 180 0 1
refdes=CONN3_1
T 56100 48500 5 10 0 1 0 0 1
footprint=JUMPER2
T 56100 48500 5 10 0 0 0 0 1
net=GND:2
T 56100 48500 5 10 0 0 0 0 1
net=5V:1
}
C 51700 48200 1 0 0 input-2.sym
{
T 52300 48900 5 10 0 0 0 0 1
device=none
T 51700 48400 5 10 0 0 0 0 1
net=GND
T 52200 48300 5 10 1 1 0 7 1
value=GND
}
C 52900 47900 1 0 0 input-2.sym
{
T 53500 48600 5 10 0 0 0 0 1
device=none
T 52900 48100 5 10 0 0 0 0 1
net=5V
T 53400 48000 5 10 1 1 0 7 1
value=5V
}
N 53100 48300 54400 48300 4
N 54300 48000 54400 48000 4
T 50000 40700 9 10 1 0 0 0 1
5 v, 12 v and 24 v testbench
T 51000 40100 9 10 1 0 0 0 1
2
T 51500 40100 9 10 1 0 0 0 1
2
T 53800 40400 9 10 1 0 0 0 1
1.0
T 53900 40100 9 10 1 0 0 0 1
Olliver Schinagl
T 49900 40400 9 10 1 0 0 0 1
Testbench_connectors_v1.sch
C 45100 47400 1 180 0 connector2-1.sym
{
T 44900 46400 5 10 0 0 180 0 1
device=CONNECTOR_2
T 45100 46600 5 10 1 1 180 0 1
refdes=CONN1_2
T 45100 47400 5 10 0 1 0 0 1
footprint=JUMPER2
T 45100 47400 5 10 0 0 0 0 1
net=GND:2
T 45100 47400 5 10 0 0 0 0 1
net=VCC:1
}
C 40700 47100 1 0 0 input-2.sym
{
T 41300 47800 5 10 0 0 0 0 1
device=none
T 40700 47300 5 10 0 0 0 0 1
net=GND
T 41200 47200 5 10 1 1 0 7 1
value=GND
}
C 41900 46800 1 0 0 input-2.sym
{
T 42500 47500 5 10 0 0 0 0 1
device=none
T 41900 47000 5 10 0 0 0 0 1
net=VCC
T 42400 46900 5 10 1 1 0 7 1
value=VCC
}
N 42100 47200 43400 47200 4
N 43300 46900 43400 46900 4
C 50600 47400 1 180 0 connector2-1.sym
{
T 50400 46400 5 10 0 0 180 0 1
device=CONNECTOR_2
T 50600 46600 5 10 1 1 180 0 1
refdes=CONN2_2
T 50600 47400 5 10 0 1 0 0 1
footprint=JUMPER2
T 50600 47400 5 10 0 0 0 0 1
net=GND:2
T 50600 47400 5 10 0 0 0 0 1
net=12V:1
}
C 46200 47100 1 0 0 input-2.sym
{
T 46800 47800 5 10 0 0 0 0 1
device=none
T 46200 47300 5 10 0 0 0 0 1
net=GND
T 46700 47200 5 10 1 1 0 7 1
value=GND
}
C 47400 46800 1 0 0 input-2.sym
{
T 48000 47500 5 10 0 0 0 0 1
device=none
T 47400 47000 5 10 0 0 0 0 1
net=12V
T 47900 46900 5 10 1 1 0 7 1
value=12V
}
N 47600 47200 48900 47200 4
N 48800 46900 48900 46900 4
C 56100 47400 1 180 0 connector2-1.sym
{
T 55900 46400 5 10 0 0 180 0 1
device=CONNECTOR_2
T 56100 46600 5 10 1 1 180 0 1
refdes=CONN3_2
T 56100 47400 5 10 0 1 0 0 1
footprint=JUMPER2
T 56100 47400 5 10 0 0 0 0 1
net=GND:2
T 56100 47400 5 10 0 0 0 0 1
net=5V:1
}
C 51700 47100 1 0 0 input-2.sym
{
T 52300 47800 5 10 0 0 0 0 1
device=none
T 51700 47300 5 10 0 0 0 0 1
net=GND
T 52200 47200 5 10 1 1 0 7 1
value=GND
}
C 52900 46800 1 0 0 input-2.sym
{
T 53500 47500 5 10 0 0 0 0 1
device=none
T 52900 47000 5 10 0 0 0 0 1
net=5V
T 53400 46900 5 10 1 1 0 7 1
value=5V
}
N 53100 47200 54400 47200 4
N 54300 46900 54400 46900 4
C 45100 46300 1 180 0 connector2-1.sym
{
T 44900 45300 5 10 0 0 180 0 1
device=CONNECTOR_2
T 45100 45500 5 10 1 1 180 0 1
refdes=CONN1_3
T 45100 46300 5 10 0 1 0 0 1
footprint=JUMPER2
T 45100 46300 5 10 0 0 0 0 1
net=GND:2
T 45100 46300 5 10 0 0 0 0 1
net=VCC:1
}
C 40700 46000 1 0 0 input-2.sym
{
T 41300 46700 5 10 0 0 0 0 1
device=none
T 40700 46200 5 10 0 0 0 0 1
net=GND
T 41200 46100 5 10 1 1 0 7 1
value=GND
}
C 41900 45700 1 0 0 input-2.sym
{
T 42500 46400 5 10 0 0 0 0 1
device=none
T 41900 45900 5 10 0 0 0 0 1
net=VCC
T 42400 45800 5 10 1 1 0 7 1
value=VCC
}
N 42100 46100 43400 46100 4
N 43300 45800 43400 45800 4
C 50600 46300 1 180 0 connector2-1.sym
{
T 50400 45300 5 10 0 0 180 0 1
device=CONNECTOR_2
T 50600 45500 5 10 1 1 180 0 1
refdes=CONN2_3
T 50600 46300 5 10 0 1 0 0 1
footprint=JUMPER2
T 50600 46300 5 10 0 0 0 0 1
net=GND:2
T 50600 46300 5 10 0 0 0 0 1
net=12V:1
}
C 46200 46000 1 0 0 input-2.sym
{
T 46800 46700 5 10 0 0 0 0 1
device=none
T 46200 46200 5 10 0 0 0 0 1
net=GND
T 46700 46100 5 10 1 1 0 7 1
value=GND
}
C 47400 45700 1 0 0 input-2.sym
{
T 48000 46400 5 10 0 0 0 0 1
device=none
T 47400 45900 5 10 0 0 0 0 1
net=12V
T 47900 45800 5 10 1 1 0 7 1
value=12V
}
N 47600 46100 48900 46100 4
N 48800 45800 48900 45800 4
C 56100 46300 1 180 0 connector2-1.sym
{
T 55900 45300 5 10 0 0 180 0 1
device=CONNECTOR_2
T 56100 45500 5 10 1 1 180 0 1
refdes=CONN3_3
T 56100 46300 5 10 0 1 0 0 1
footprint=JUMPER2
T 56100 46300 5 10 0 0 0 0 1
net=GND:2
T 56100 46300 5 10 0 0 0 0 1
net=5V:1
}
C 51700 46000 1 0 0 input-2.sym
{
T 52300 46700 5 10 0 0 0 0 1
device=none
T 51700 46200 5 10 0 0 0 0 1
net=GND
T 52200 46100 5 10 1 1 0 7 1
value=GND
}
C 52900 45700 1 0 0 input-2.sym
{
T 53500 46400 5 10 0 0 0 0 1
device=none
T 52900 45900 5 10 0 0 0 0 1
net=5V
T 53400 45800 5 10 1 1 0 7 1
value=5V
}
N 53100 46100 54400 46100 4
N 54300 45800 54400 45800 4
C 45100 45200 1 180 0 connector2-1.sym
{
T 44900 44200 5 10 0 0 180 0 1
device=CONNECTOR_2
T 45100 44400 5 10 1 1 180 0 1
refdes=CONN1_4
T 45100 45200 5 10 0 1 0 0 1
footprint=JUMPER2
T 45100 45200 5 10 0 0 0 0 1
net=GND:2
T 45100 45200 5 10 0 0 0 0 1
net=VCC:1
}
C 40700 44900 1 0 0 input-2.sym
{
T 41300 45600 5 10 0 0 0 0 1
device=none
T 40700 45100 5 10 0 0 0 0 1
net=GND
T 41200 45000 5 10 1 1 0 7 1
value=GND
}
C 41900 44600 1 0 0 input-2.sym
{
T 42500 45300 5 10 0 0 0 0 1
device=none
T 41900 44800 5 10 0 0 0 0 1
net=VCC
T 42400 44700 5 10 1 1 0 7 1
value=VCC
}
N 42100 45000 43400 45000 4
N 43300 44700 43400 44700 4
C 50600 45200 1 180 0 connector2-1.sym
{
T 50400 44200 5 10 0 0 180 0 1
device=CONNECTOR_2
T 50600 44400 5 10 1 1 180 0 1
refdes=CONN2_4
T 50600 45200 5 10 0 1 0 0 1
footprint=JUMPER2
T 50600 45200 5 10 0 0 0 0 1
net=GND:2
T 50600 45200 5 10 0 0 0 0 1
net=12V:1
}
C 46200 44900 1 0 0 input-2.sym
{
T 46800 45600 5 10 0 0 0 0 1
device=none
T 46200 45100 5 10 0 0 0 0 1
net=GND
T 46700 45000 5 10 1 1 0 7 1
value=GND
}
C 47400 44600 1 0 0 input-2.sym
{
T 48000 45300 5 10 0 0 0 0 1
device=none
T 47400 44800 5 10 0 0 0 0 1
net=12V
T 47900 44700 5 10 1 1 0 7 1
value=12V
}
N 47600 45000 48900 45000 4
N 48800 44700 48900 44700 4
C 56100 45200 1 180 0 connector2-1.sym
{
T 55900 44200 5 10 0 0 180 0 1
device=CONNECTOR_2
T 56100 44400 5 10 1 1 180 0 1
refdes=CONN3_4
T 56100 45200 5 10 0 1 0 0 1
footprint=JUMPER2
T 56100 45200 5 10 0 0 0 0 1
net=GND:2
T 56100 45200 5 10 0 0 0 0 1
net=5V:1
}
C 51700 44900 1 0 0 input-2.sym
{
T 52300 45600 5 10 0 0 0 0 1
device=none
T 51700 45100 5 10 0 0 0 0 1
net=GND
T 52200 45000 5 10 1 1 0 7 1
value=GND
}
C 52900 44600 1 0 0 input-2.sym
{
T 53500 45300 5 10 0 0 0 0 1
device=none
T 52900 44800 5 10 0 0 0 0 1
net=5V
T 53400 44700 5 10 1 1 0 7 1
value=5V
}
N 53100 45000 54400 45000 4
N 54300 44700 54400 44700 4
C 42800 42700 1 0 0 hole-1.sym
{
T 42800 42700 5 10 0 1 0 0 1
device=HOLE
T 43000 43300 5 10 1 1 0 4 1
refdes=H1
T 42800 42700 5 10 0 0 0 0 1
net=GND:1
T 42800 42700 5 10 0 1 0 0 1
footprint=hole_m3_plated
}
C 43400 42700 1 0 0 hole-1.sym
{
T 43400 42700 5 10 0 1 0 0 1
device=HOLE
T 43600 43300 5 10 1 1 0 4 1
refdes=H2
T 43400 42700 5 10 0 1 0 0 1
footprint=hole_m3_plated
T 43400 42700 5 10 0 0 0 0 1
net=GND:1
}
C 44000 42700 1 0 0 hole-1.sym
{
T 44000 42700 5 10 0 1 0 0 1
device=HOLE
T 44200 43300 5 10 1 1 0 4 1
refdes=H3
T 44000 42700 5 10 0 0 0 0 1
net=GND:1
T 44000 42700 5 10 0 1 0 0 1
footprint=hole_m3_plated
}
C 44600 42700 1 0 0 hole-1.sym
{
T 44600 42700 5 10 0 1 0 0 1
device=HOLE
T 44800 43300 5 10 1 1 0 4 1
refdes=H4
T 44600 42700 5 10 0 0 0 0 1
net=GND:1
T 44600 42700 5 10 0 1 0 0 1
footprint=hole_m3_plated
}
C 41300 42600 1 0 0 input-2.sym
{
T 41300 42800 5 10 0 0 0 0 1
net=GND:1
T 41900 43300 5 10 0 0 0 0 1
device=none
T 41800 42700 5 10 1 1 0 7 1
value=GND
}
N 42700 42700 44800 42700 4
