M48
METRIC,000.000
T159C0.500
T158C2.400
T157C2.200
T156C2.250
T155C3.302
T154C1.092
T153C0.965
T152C0.762
T151C3.300
T150C1.524
%
T159
X016000Y066000
X016000Y063000
X016000Y060000
X016000Y057000
X016000Y054000
X019000Y066000
X019000Y063000
X019000Y060000
X019000Y054000
X022000Y066000
X022000Y063000
X022000Y060000
X022000Y054000
X025000Y066000
X025000Y063000
X025000Y060000
X025000Y057000
X025000Y054000
X033000Y066000
X033000Y063000
X033000Y060000
X033000Y057000
X033000Y054000
X036000Y066000
X036000Y063000
X036000Y060000
X036000Y054000
X039000Y066000
X039000Y063000
X039000Y060000
X039000Y054000
X042000Y066000
X042000Y063000
X042000Y060000
X042000Y057000
X042000Y054000
T152
X005150Y083000
X011500Y083000
X027710Y071000
X030250Y071000
X044460Y071000
X047000Y071000
T153
X004833Y046003
X012460Y033000
X012460Y024000
X012460Y015000
X012460Y006000
X014993Y046003
X015000Y033000
X015000Y024000
X015000Y015000
X015000Y006000
X020000Y046000
X023750Y033000
X023750Y024000
X023750Y015000
X023750Y006000
X026290Y033000
X026290Y024000
X026290Y015000
X026290Y006000
X030160Y046000
X035000Y046004
X035000Y033000
X035000Y024000
X035000Y015000
X035000Y006000
X037540Y033000
X037540Y024000
X037540Y015000
X037540Y006000
X045160Y046004
T154
X012460Y042000
X015000Y042000
X023750Y042000
X026290Y042000
X035000Y042000
X037540Y042000
T150
X011500Y095780
X011500Y090700
X014040Y090700
X016580Y095780
X016580Y090700
X018000Y074000
X020540Y074000
X023080Y074000
X035000Y074000
X037540Y074000
X040080Y074000
T157
X031000Y094300
T156
X023200Y092250
X038800Y092250
T158
X023200Y083750
X028000Y085100
X028500Y088750
X033500Y088750
X034000Y085100
X038800Y083850
T151
X005000Y095000
X005000Y005000
X045000Y095000
X045000Y005000
T155
X020540Y056982
X037540Y056982
M30
