// Mem file initialization records.
//
// SW Build 1577090 on Thu Jun  2 16:32:35 MDT 2016
// Vivado v2016.2 (64-bit)
// Copyright 1986-2016 Xilinx, Inc. All Rights Reserved.
// Created on Wednesday June 22, 2016 - 02:13:14 pm, from:
//
//     Map file     - /home/oliver/dev/ultilabs/yoda_fpga/yoda_fpga.srcs/sources_1/bd/system/system.bmm
//     Data file(s) - /home/oliver/dev/ultilabs/yoda_fpga/yoda_fpga.srcs/sources_1/bd/system/ip/system_microblaze_0_0/data/mb_bootloop_le.elf
//
// Address space 'system_i_microcontroller_0_microblaze_0.system_i_microcontroller_0_microblaze_0_local_memory_lmb_bram_ADDR_SPACE', bit lane [31:0].
//
// Bus width = 32 bits, number of bus blocks = 1.

@00000000
    B8000000
