<?xml version="1.0" encoding="UTF-8"?>
<session version="1.0">
<refactoring comment="Delete resource &apos;mb_marlin/src/xintc_tapp_example.c&apos;" deleteContents="false" description="Delete resource &apos;mb_marlin/src/xintc_tapp_example.c&apos;" element1="/mb_marlin/src/xintc_tapp_example.c" flags="7" id="org.eclipse.ltk.core.refactoring.delete.resources" resources="1" stamp="1466420926651"/>
</session>