// Mem file initialization records.
//
// SW Build 1577090 on Thu Jun  2 16:32:35 MDT 2016
// Vivado v2016.2 (64-bit)
// Copyright 1986-2016 Xilinx, Inc. All Rights Reserved.
// Created on Monday June 20, 2016 - 01:57:57 pm, from:
//
//     Map file     - /home/erik/marlin_zynq/marlin_zynq.srcs/sources_1/bd/Block_design/Block_design.bmm
//     Data file(s) - /home/erik/marlin_zynq/marlin_zynq.srcs/sources_1/bd/Block_design/ip/Block_design_microblaze_0_0/data/mb_bootloop_le.elf
//
// Address space 'Block_design_i_Microblaze_block_microblaze_0.Block_design_i_Microblaze_block_microblaze_0_local_memory_lmb_bram_ADDR_SPACE', bit lane [31:0].
//
// Bus width = 32 bits, number of bus blocks = 1.

@00000000
    B8000000
