{
  "inherit": "jedi.json",
  "properties": {
    "marlin_firmware_filename": "watto.hex",
    "machine_type_name": "Watto",
    "hotend_count": 1,
    "build_volume_x": 215,
    "build_volume_y": 215,
    "build_volume_z": 205,
    "default_hotend_pid": {"Kff": 0.0, "Kp": 10.0, "Ki": 2.5, "Kd": 100.0, "Ki_max": 255},
    "default_steps_per_mm": {"X": 80.0, "Y": 80.0, "Z": 200.0, "E": 369.0},
    "feature_heated_bed": true,
    "feature_bed_leveling_sensor": false,
    "feature_filament_flow_sensor": false
  },
  "procedures": {
    "PRE_PRINT_SETUP": ["genericProcedure.GenericProcedure",
      ["DUMMYING", "dummyStep.DummyStep"],
      ["CHECK", "pre_and_post_print.runChecksBeforePrint.RunChecksBeforePrint"],
      ["APPLY_XY_CALIBRATION", "pre_and_post_print.applyXyAlignmentStep.ApplyXyAlignmentStep"],
      ["SET_HOTEND_TEMPERATURE_0", "otherProcedureStep.OtherProcedureStep", "SET_HOTEND_TEMPERATURE", {"hotend_nr": 0, "target": "standby_temperature"}],
      ["RESET_PRINT_SPEED", "steps.setPropertyStep.SetPropertyStep", "printer", "movement_speed_modifier", 100.0],
      ["HOME_BED", "steps.homeBedStep.HomeBedStep"],
      ["HOME_HEAD", "steps.homeHeadStep.HomeHeadStep"],
      ["RESET_ACTIVE_HOTEND", "print.switchActiveHotendStep.SwitchActiveHotendStep", "reset"],
      ["BED_LEVEL_DETECTION", "otherProcedureStep.OtherProcedureStep", "ALIGN_Z_AXIS"],
      ["MOVE_TO_PRIME_POSITION", "steps.gotoPositionStep.GotoPositionStep", {"x": 180.0, "y": 6.0, "z": 20}],
      ["WAIT_BED_TEMPERATURE", "otherProcedureStep.OtherProcedureStep", "SET_BED_TEMPERATURE_WAIT", {"target": "initial_temperature"}],
      ["HEATUP_HOTEND_WAIT_0", "otherProcedureStep.OtherProcedureStep", "SET_HOTEND_TEMPERATURE_WAIT", {"hotend_nr": 0, "target": "initial_temperature"}],
      ["PRIME_ALL_NOZZLES", "otherProcedureStep.OtherProcedureStep", "PRIME_NOZZLE"],
      ["WAITING", "waitForQueueEmptyStep.WaitForQueueToBeEmptyStep"]
    ],
    "GENERIC_WIZARD_FINISHING_PROCEDURE":["genericProcedure.GenericProcedure",
      ["START_COOLDOWN_HOTEND", "steps.setPropertyStep.SetPropertyStep", "printer.head.0.hotend.0", "pre_tune_target_temperature", 0.0],
      ["HOME_HEAD", "steps.homeHeadStep.HomeHeadStep"],
      ["SWITCH_TO_HOTEND", "otherProcedureStep.OtherProcedureStep", "SWITCH_ACTIVE_HOTEND", {"target": 1}],
      ["HOME_HEAD", "steps.homeHeadStep.HomeHeadStep"],
      ["POWER_DOWN_MOTORS", "queueRawGCodeWaitStep.QueueRawGCodeWaitStep", "M84"],
      ["WIZARD_COMPLETE", "waitForQueueEmptyStep.WaitForQueueToBeEmptyStep"]
    ]
  }
}