{
    "card": {
        "image": {
            "mobileWidth": {
                "url": "/generator/svg/120/120"
            }
        },
        "name": "Reseller name",
        "preferred": true,
        "showroomCount": 2,
        "href": "https://lipsum.com",
        "labels": {
            "visitWebsite": "Visit website",
            "multiShowroomLabel": "showrooms",
            "singleShowroomLabel": "showroom"
        }
    }
}
