{
    "title": "Lorem ipsum dolor sit amet",
    "brands": [
        {
            "image": {
                "alt": "Lorem Ipsum",
                "styleModifier": "brand-card__image",
                "mobileWidth": {
                    "url": "/generator/svg/240/240"
                }
            },
            "body": "Lorem ipsum dolor sit amet, consectetur adipisicing elit. Ab quis vitae, esse sunt libero inventore."
        },
        {
            "image": {
                "alt": "Lorem Ipsum",
                "styleModifier": "brand-card__image",
                "mobileWidth": {
                    "url": "/generator/svg/240/240"
                }
            },
            "body": "Lorem ipsum dolor sit amet, consectetur adipisicing elit. Culpa ullam eligendi voluptatum iste ducimus illum."
        },
        {
            "image": {
                "alt": "Lorem Ipsum",
                "styleModifier": "brand-card__image",
                "mobileWidth": {
                    "url": "/generator/svg/240/240"
                }
            },
            "body": "Lorem ipsum dolor sit amet, consectetur adipisicing elit. Blanditiis omnis, in illum aut atque unde."
        }
    ],
    "contentLink": {
        "href": "#",
        "text": "Lorem ipsum dolor sit amet, consectetur adipisicing elit."
    }
}
