{
  "heroes": [
    {
      "id": 11,
      "name": "Dr Nicer"
    },
    {
      "id": 12,
      "name": "Narco oz"
    },
    {
      "id": 13,
      "name": "Bombasto"
    },
    {
      "id": 14,
      "name": "Celeritas"
    },
    {
      "id": 16,
      "name": "RubberMan"
    },
    {
      "id": 17,
      "name": "Dynama"
    },
    {
      "id": 18,
      "name": "Dr IQ"
    },
    {
      "id": 19,
      "name": "Magma"
    },
    {
      "id": 20,
      "name": "Tornado"
    },
    {
      "id": 21,
      "name": "Dr Bad"
    },
    {
      "id": 22,
      "name": "Burk"
    },
    {
      "id": 23,
      "name": "Tyron"
    },
    {
      "id": 24,
      "name": "Killor"
    },
    {
      "id": 25,
      "name": "Bummy"
    },
    {
      "id": 26,
      "name": "Trank"
    },
    {
      "id": 27,
      "name": "Plunk"
    },
    {
      "id": 28,
      "name": "Quans"
    },
    {
      "id": 29,
      "name": "Prat"
    },
    {
      "id": 30,
      "name": "Vulcan"
    }
  ]
}