{
  "project_info": {
    "project_number": "931448703020",
    "firebase_url": "https://santefr-e7d33.firebaseio.com",
    "project_id": "santefr-e7d33",
    "storage_bucket": "santefr-e7d33.appspot.com"
  },
  "client": [
    {
      "client_info": {
        "mobilesdk_app_id": "1:931448703020:android:97dc0406f74cfa41",
        "android_client_info": {
          "package_name": "com.adyax.srisgp"
        }
      },
      "oauth_client": [
        {
          "client_id": "931448703020-jq6lddd1isrhpi1fh746o2ij3nq1blsp.apps.googleusercontent.com",
          "client_type": 1,
          "android_info": {
            "package_name": "com.adyax.srisgp",
            "certificate_hash": "c190a55d7cd80825178f8a4ce648ecc83c7c15cd"
          }
        },
        {
          "client_id": "931448703020-vrikvhv6d81pvcj2cgnippcatdba01n2.apps.googleusercontent.com",
          "client_type": 3
        }
      ],
      "api_key": [
        {
          "current_key": "AIzaSyCZzapYGCsBAvXml5FyV4N6tXGqBYAc3WU"
        }
      ],
      "services": {
        "appinvite_service": {
          "other_platform_oauth_client": [
            {
              "client_id": "931448703020-vrikvhv6d81pvcj2cgnippcatdba01n2.apps.googleusercontent.com",
              "client_type": 3
            }
          ]
        }
      }
    },
    {
      "client_info": {
        "mobilesdk_app_id": "1:931448703020:android:907155b9f1b979fe",
        "android_client_info": {
          "package_name": "com.adyax.srisgp.dev"
        }
      },
      "oauth_client": [
        {
          "client_id": "931448703020-vrikvhv6d81pvcj2cgnippcatdba01n2.apps.googleusercontent.com",
          "client_type": 3
        }
      ],
      "api_key": [
        {
          "current_key": "AIzaSyCZzapYGCsBAvXml5FyV4N6tXGqBYAc3WU"
        }
      ],
      "services": {
        "appinvite_service": {
          "other_platform_oauth_client": [
            {
              "client_id": "931448703020-vrikvhv6d81pvcj2cgnippcatdba01n2.apps.googleusercontent.com",
              "client_type": 3
            }
          ]
        }
      }
    },
    {
      "client_info": {
        "mobilesdk_app_id": "1:931448703020:android:de64f5eb0cff474a",
        "android_client_info": {
          "package_name": "com.adyax.srisgp.ppr"
        }
      },
      "oauth_client": [
        {
          "client_id": "931448703020-vrikvhv6d81pvcj2cgnippcatdba01n2.apps.googleusercontent.com",
          "client_type": 3
        }
      ],
      "api_key": [
        {
          "current_key": "AIzaSyCZzapYGCsBAvXml5FyV4N6tXGqBYAc3WU"
        }
      ],
      "services": {
        "appinvite_service": {
          "other_platform_oauth_client": [
            {
              "client_id": "931448703020-vrikvhv6d81pvcj2cgnippcatdba01n2.apps.googleusercontent.com",
              "client_type": 3
            }
          ]
        }
      }
    },
    {
      "client_info": {
        "mobilesdk_app_id": "1:931448703020:android:0df3f6da10b85348",
        "android_client_info": {
          "package_name": "com.adyax.srisgp.stage"
        }
      },
      "oauth_client": [
        {
          "client_id": "931448703020-vrikvhv6d81pvcj2cgnippcatdba01n2.apps.googleusercontent.com",
          "client_type": 3
        }
      ],
      "api_key": [
        {
          "current_key": "AIzaSyCZzapYGCsBAvXml5FyV4N6tXGqBYAc3WU"
        }
      ],
      "services": {
        "appinvite_service": {
          "other_platform_oauth_client": [
            {
              "client_id": "931448703020-vrikvhv6d81pvcj2cgnippcatdba01n2.apps.googleusercontent.com",
              "client_type": 3
            }
          ]
        }
      }
    }
  ],
  "configuration_version": "1"
}